4,4-dimethyl-2-hexene (cis-trans not specified)
- Formula: C8H16
- Molecular weight: 112.2126
- IUPAC Standard InChIKey: OQEVAISXHCRQGF-FNORWQNLSA-N
- CAS Registry Number: 3404-59-9
- Chemical structure:
View 3d structure (requires JavaScript / HTML 5) - Species with the same structure:
- Stereoisomers:

Phase change data

Data compiled by: Thermodynamics Research Center, NIST Boulder Laboratories, Chris Muzny director
Quantity | Value | Units | Method | Reference | Comment |
---|---|---|---|---|---|
Tboil | 378.75 | K | N/A | Goldwasser and Taylor, 1939 | Uncertainty assigned by TRC = 0.6 K |
Tboil | 378.85 | K | N/A | Schurman and Boord, 1933 | Uncertainty assigned by TRC = 1. K |

References

Goldwasser and Taylor, 1939
Goldwasser, S.; Taylor, H.S.,
Catalytic dehydration of c6-c8 aliphatic alcohols,
J. Am. Chem. Soc., 1939, 61, 1751. [all data]
Schurman and Boord, 1933
Schurman, I.; Boord, C.E.,
Synthesis in teh Olefin Series V. Completing the Survey of the Hexenes and Including Certain Heptenes and Octenes,
J. Am. Chem. Soc., 1933, 55, 4930-5. [all data]