3-Ethylhex-1-ene
- Formula: C8H16
- Molecular weight: 112.2126
- IUPAC Standard InChIKey: OLGHJTHQWQKJQQ-UHFFFAOYSA-N
- CAS Registry Number: 3404-58-8
- Chemical structure:
View 3d structure (requires JavaScript / HTML 5) - Other names: 1-Hexene, 3-ethyl-; 3-Ethyl-1-hexene

Phase change data

Data compiled by: William E. Acree, Jr., James S. Chickos
Quantity | Value | Units | Method | Reference | Comment |
---|---|---|---|---|---|
ΔvapH° | 38.5 | kJ/mol | N/A | Reid, 1972 |

Kovats' RI, non-polar column, isothermal

View large format table.

Column type Active phase Temperature (C) I Reference Comment
CapillaryPetrocol DH30.744.8Soják, Addová, et al., 2004150. m/0.25 mm/1. μm, H2
CapillarySqualane30.735.5Soják, Addová, et al., 2004He; Column length: 93. m; Column diameter: 0.25 mm
CapillarySqualane40.738.Matukuma, 1969N2; Column length: 91.4 m; Column diameter: 0.25 mm

Normal alkane RI, non-polar column, temperature ramp

View large format table.

Column type Active phase I Reference Comment
CapillaryPetrocol DH745.Sojak, Kubinec, et al., 2006150. m/0.25 mm/1.0 μm, 1. K/min; Tstart: 40. C; Tend: 300. C
CapillaryPetrocol DH745.Sojak, Kubinec, et al., 2006150. m/0.25 mm/1.0 μm, 1. K/min; Tstart: 40. C; Tend: 300. C
CapillaryPetrocol DH745.Sojak, Kubinec, et al., 2006150. m/0.25 mm/1.0 μm, 1. K/min; Tstart: 40. C; Tend: 300. C

References

Reid, 1972
Reid, Robert C.,
Handbook on vapor pressure and heats of vaporization of hydrocarbons and related compounds, R. C. Wilhort and B. J. Zwolinski, Texas A Research Foundation. College Station, Texas(1971). 329 pages.$10.00,
AIChE J., 1972, 18, 6, 1278-1278, https://doi.org/10.1002/aic.690180637
. [all data]