4-Methyl-2-heptene
- Formula: C8H16
- Molecular weight: 112.2126
- IUPAC Standard InChIKey: SVGLFIBXFVQUQY-UHFFFAOYSA-N
- CAS Registry Number: 3404-56-6
- Chemical structure:
View 3d structure (requires JavaScript / HTML 5) - Stereoisomers:
- Other names: 2-heptene, 4-methyl-

Phase change data

Data compiled by: Thermodynamics Research Center, NIST Boulder Laboratories, Chris Muzny director
Quantity | Value | Units | Method | Reference | Comment |
---|---|---|---|---|---|
Tboil | 386.65 | K | N/A | Henne, Chanan, et al., 1941 | Uncertainty assigned by TRC = 0.5 K |
Tboil | 387.1 | K | N/A | Mulliken, Wakeman, et al., 1935 | Uncertainty assigned by TRC = 0.6 K |

Kovats' RI, non-polar column, isothermal

Column type | Active phase | Temperature (C) | I | Reference | Comment |
---|---|---|---|---|---|
Capillary | Squalane | 40. | 746.2 | Schomburg and Dielmann, 1973 | Column length: 100. m; Column diameter: 0.25 mm |

References

Henne, Chanan, et al., 1941
Henne, A.L.; Chanan, H.H.; Turk, A.,
Olefins and Diolefins from Allylic Chlorides,
J. Am. Chem. Soc., 1941, 63, 3474-6. [all data]
Mulliken, Wakeman, et al., 1935
Mulliken, S.P.; Wakeman, R.L.; Gerry, H.T.,
The preparation of certain alkenes, alkadienes and alkynes,
J. Am. Chem. Soc., 1935, 57, 1605-7. [all data]