auranofin

Phase change data

Data compiled by: William E. Acree, Jr., James S. Chickos

Enthalpy of fusion

ΔfusH (kJ/mol) Temperature (K) Reference
37.82385.LINDENBAUM, RATTIE, et al., 1985

References

LINDENBAUM, RATTIE, et al., 1985
LINDENBAUM, S.; RATTIE, E.; ZUBER, G.; MILLER, M.; RAVIN, L., Polymorphism of auranofin, International Journal of Pharmaceutics, 1985, 26, 1-2, 123-132, https://doi.org/10.1016/0378-5173(85)90205-4 . [all data]