Tebuthiuron
- Formula: C9H16N4OS
- Molecular weight: 228.315
- IUPAC Standard InChIKey: HBPDKDSFLXWOAE-UHFFFAOYSA-N
- CAS Registry Number: 34014-18-1
- Chemical structure:
View 3d structure (requires JavaScript / HTML 5) - Other names: Urea, N-[5-(1,1-dimethylethyl)-1,3,4-thiadiazol-2-yl]-N,N'-dimethyl-; Urea, 1-(5-tert-butyl-1,3,4-thiadiazol-2-yl)-1,3-dimethyl-; EL 103; Spike; Urea, 1-(5-(t-butyl)-1,3,4-thiadiazol-2-yl)-1,3-dimethyl-; Brulan; 1-(5-tert-Butyl-1,3,4-thiadiazol-2-yl)-3-dimethylharnstoff; 1-(5-tert-Butyl-1,3,4-thiadiazol-2-yl)-1,3-dimethylurea; N-(5-(1,1-Dimethylaethyl)-1,3,4-thiadiazol-2-yl)-N,N'-dimethylharnstoff; Graslan; Perflan; Perfmid; Preflan; Prefmid; Tebulan; Tiurolan; Bushwacker; N-(5-tert-Butyl-1,3,4-thiadiazol-2-yl)-N,N'-dimethylurea; N-[5-(1,1-Dimethylethyl)-1,3,4-thiadiazol-2-yl]-NN'-dimethylurea; Graslan 250 brush bullets; Spike 80W

Phase change data

Data compiled as indicated in comments:
TRC - Thermodynamics Research Center, NIST Boulder Laboratories, Chris Muzny director
AC - William E. Acree, Jr., James S. Chickos
Quantity | Value | Units | Method | Reference | Comment |
---|---|---|---|---|---|
Tfus | 436.61 | K | N/A | Donnelly, Drewes, et al., 1990 | Uncertainty assigned by TRC = 0.2 K; TRC |
Enthalpy of fusion
ΔfusH (kcal/mol) | Temperature (K) | Method | Reference | Comment |
---|---|---|---|---|
7.046 | 435.3 | DSC | Acree, 1991 | See also Donnelly, Drewes, et al., 1990, 2.; AC |

References

Donnelly, Drewes, et al., 1990
Donnelly, J.R.; Drewes, L.A.; Johnson, R.L.; Munslow, W.D.; Knapp, K.K.; Sovocool, G.W.,
Purity and heat of fusion data for environmental standards as determined by differential scanning calorimetry,
Thermochim. Acta, 1990, 167, 2, 155, https://doi.org/10.1016/0040-6031(90)80476-F
. [all data]
Acree, 1991
Acree, William E.,
Thermodynamic properties of organic compounds: enthalpy of fusion and melting point temperature compilation,
Thermochimica Acta, 1991, 189, 1, 37-56, https://doi.org/10.1016/0040-6031(91)87098-H
. [all data]
Donnelly, Drewes, et al., 1990, 2
Donnelly, J.R.; Drewes, L.A.; Johnson, R.L.; Munslow, W.D.; Knapp, K.K.; Sovocool, G.W.,
Purity and heat of fusion data for environmental standards as determined by differential scanning calorimetry,
Thermochimica Acta, 1990, 167, 2, 155-187, https://doi.org/10.1016/0040-6031(90)80476-F
. [all data]