Neopentyl-4,4,4-trinitrobutyrate
- Formula: C9H15N3O8
- Molecular weight: 293.2307
- IUPAC Standard InChIKey: IEYOGMGJULXDOB-UHFFFAOYSA-N
- CAS Registry Number: 34001-52-0
- Chemical structure:
View 3d structure (requires JavaScript / HTML 5) - Permanent link for this species. Use this link for bookmarking this species for future reference.

Phase change data

Data compiled as indicated in comments:
TRC - Thermodynamics Research Center, NIST Boulder Laboratories, Chris Muzny director
AC - William E. Acree, Jr., James S. Chickos
Quantity | Value | Units | Method | Reference | Comment |
---|---|---|---|---|---|
Tfus | 333. | K | N/A | Rosen, Holden, et al., 1971 | Uncertainty assigned by TRC = 0.1 K; TRC |
Enthalpy of fusion
ΔfusH (kcal/mol) | Temperature (K) | Method | Reference | Comment |
---|---|---|---|---|
5.399 | 333.5 | DSC | Rosen, Holden, et al., 1971 | AC |

References

Rosen, Holden, et al., 1971
Rosen, J.M.; Holden, J.R.; Simmons, H.T., Sr.,
Microscope, 1971, 19, 2, 151. [all data]