7-Norbornyl t-butyl ether
- Formula: C11H20O
- Molecular weight: 168.2759
- IUPAC Standard InChIKey: XFWPUNKKVHXJGD-UHFFFAOYSA-N
- CAS Registry Number: 3391-07-9
- Chemical structure:
View 3d structure (requires JavaScript / HTML 5) - Other names: 7-tert-Butoxynorbornane

Phase change data

Data compiled by: Robert L. Brown and Stephen E. Stein
Reduced pressure boiling point
Tboil (K) | Pressure (bar) | Reference |
---|---|---|
353. to 354. | 0.020 | Frinton Laboratories Inc., 1986 |

References

Frinton Laboratories Inc., 1986
Frinton Laboratories Inc.,
Catalog Number 11, Frinton Laboratories Inc., Vineland, NJ, 1986, 99. [all data]