1-Butene, 4-isothiocyanato-
- Formula: C5H7NS
- Molecular weight: 113.181
- IUPAC Standard InChIKey: SKIHGKNFJKJXPX-UHFFFAOYSA-N
- CAS Registry Number: 3386-97-8
- Chemical structure:
View 3d structure (requires JavaScript / HTML 5) - Other names: Isothiocyanic acid, 3-butenyl ester; 3-Butenyl isothiocyanate; But-3-enyl isothiocyanate; 4-Isothiocyanatobut-1-ene; 4-Isothiocyanato-1-butene; 1-butene 4-isothiocyanate

Phase change data

Data compiled by: William E. Acree, Jr., James S. Chickos
Enthalpy of vaporization
ΔvapH (kJ/mol) | Temperature (K) | Method | Reference | Comment |
---|---|---|---|---|
45.2 | 357. | A | Stephenson and Malanowski, 1987 | Based on data from 342. to 443. K. See also Dykyj, Svoboda, et al., 1999. |

Van Den Dool and Kratz RI, non-polar column, temperature ramp

Column type | Active phase | I | Reference | Comment |
---|---|---|---|---|
Capillary | Mega 5MS | 985. | Condurso, Verzera, et al., 2006 | 60. m/0.25 mm/0.25 μm, He, 3. K/min; Tstart: 60. C; Tend: 240. C |
Capillary | HP-5MS | 1006. | Afsharypuor and Suleimany, 2002 | 30. m/0.25 mm/0.25 μm, He, 4. K/min; Tstart: 60. C; Tend: 275. C |

Van Den Dool and Kratz RI, non-polar column, custom temperature program

Column type | Active phase | I | Reference | Comment |
---|---|---|---|---|
Capillary | HP-5MS | 982.6 | Andriamaharavo, 2014 | 30. m/0.25 mm/0.25 μm, He; Program: 60C (1 min) => 5 C/min => 210C => 10 C/min => 280C (15 min) |
Capillary | HP-5 | 978. | Engel, Baty, et al., 2002 | 30. m/0.25 mm/0.25 μm, He; Program: 5C(5min) => 3C/min => 20C => 5C/min => 100C 15C/min => 150C (5min) |

Van Den Dool and Kratz RI, polar column, temperature ramp

Column type | Active phase | I | Reference | Comment |
---|---|---|---|---|
Capillary | DB-Wax | 1453. | Cha, Kim, et al., 1998 | 60. m/0.25 mm/0.25 μm, 40. C @ 5. min, 3. K/min, 200. C @ 60. min |

Van Den Dool and Kratz RI, polar column, custom temperature program

Column type | Active phase | I | Reference | Comment |
---|---|---|---|---|
Capillary | CP-Wax 52CB | 1459. | Condurso, Verzera, et al., 2006 | 60. m/0.25 mm/0.25 μm, He; Program: 45C(5min) => 10C/min => 80C => 2C/min => 240C |

Normal alkane RI, non-polar column, temperature ramp

Column type | Active phase | I | Reference | Comment |
---|---|---|---|---|
Capillary | HP-101 | 982. | Blazevic and Mastelic, 2008 | 25. m/0.20 mm/0.25 μm, Helium, 70. C @ 2. min, 3. K/min; Tend: 200. C |
Capillary | HP-1 | 964. | Breme, Langle, et al., 2008 | 50. m/0.20 mm/0.33 μm, Helium, 2. K/min, 250. C @ 20. min; Tstart: 60. C |
Capillary | HP-1 | 951. | Valette, Fernandez, et al., 2006 | 50. m/0.2 mm/0.5 μm, He, 2. K/min, 250. C @ 40. min; Tstart: 60. C |
Capillary | HP-1 | 959. | Bendimerad and Bendiab, 2005 | 50. m/0.2 mm/0.5 μm, He, 2. K/min, 250. C @ 60. min; Tstart: 60. C |
Capillary | DB-5 | 973. | Miyazawa, Nishiguchi, et al., 2005 | 30. m/0.25 mm/0.25 μm, He, 3. K/min; Tstart: 60. C; Tend: 240. C |
Capillary | CP Sil 5 CB | 982. | Rohloff and Bones, 2005 | 30. m/0.25 mm/0.25 μm, He, 40. C @ 1. min, 4. K/min; Tend: 220. C |

Normal alkane RI, non-polar column, custom temperature program

Column type | Active phase | I | Reference | Comment |
---|---|---|---|---|
Capillary | SPB-5 | 984. | Begnaud, Pérès, et al., 2003 | 60. m/0.32 mm/1. μm; Program: not specified |
Capillary | SF96+Igepal | 965. | Flath, Altieri, et al., 1984 | Column length: 152. m; Column diameter: 0.76 mm; Program: 25C(1min) => 5C/min => 50C (4min) => 1.25C/min => 180C |

Normal alkane RI, polar column, temperature ramp

Column type | Active phase | I | Reference | Comment |
---|---|---|---|---|
Capillary | HP-20M | 1403. | Blazevic and Mastelic, 2008 | 50. m/0.25 mm/0.25 μm, Helium, 70. C @ 4. min, 4. K/min; Tend: 180. C |
Capillary | HP-20M | 1403. | Blazevic and Mastelic, 2008 | 50. m/0.25 mm/0.25 μm, Helium, 70. C @ 4. min, 4. K/min; Tend: 180. C |
Capillary | HP-20M | 1416. | Breme, Langle, et al., 2008 | 50. m/0.20 mm/0.20 μm, Helium, 2. K/min, 220. C @ 20. min; Tstart: 60. C |
Capillary | TC-WAX FFS | 1463. | Miyazawa, Maehara, et al., 2002 | He, 3. K/min; Column length: 60. m; Column diameter: 0.25 mm; Tstart: 60. C; Tend: 240. C |

References

Stephenson and Malanowski, 1987
Stephenson, Richard M.; Malanowski, Stanislaw,
Handbook of the Thermodynamics of Organic Compounds, 1987, https://doi.org/10.1007/978-94-009-3173-2
. [all data]
Dykyj, Svoboda, et al., 1999
Dykyj, J.; Svoboda, J.; Wilhoit, R.C.; Frenkel, M.L.; Hall, K.R.,
Vapor Pressure of Chemicals: Part A. Vapor Pressure and Antoine Constants for Hydrocarbons and Sulfur, Selenium, Tellurium and Hydrogen Containing Organic Compounds, Springer, Berlin, 1999, 373. [all data]
Condurso, Verzera, et al., 2006
Condurso, C.; Verzera, A.; Romeo, V.; Ziino, M.; Trozzi, A.; Ragusa, S.,
The leaf volatile constituents of Isatis tinctoria by solid-phase microextraction and gas chromatography/mass spectrometry,
Planta Medica, 2006, 72, 10, 924-928, https://doi.org/10.1055/s-2006-946679
. [all data]
Afsharypuor and Suleimany, 2002
Afsharypuor, S.; Suleimany, M.,
Volatile oil constituents of Brassica oleracea var. gongylodes seeds,
J. Essent. Oil Res., 2002, 14, 1, 18-19, https://doi.org/10.1080/10412905.2002.9699748
. [all data]
Andriamaharavo, 2014
Andriamaharavo, N.R.,
Retention Data. NIST Mass Spectrometry Data Center., NIST Mass Spectrometry Data Center, 2014. [all data]
Engel, Baty, et al., 2002
Engel, E.; Baty, C.; le Corre, D.; Souchon, I.; Martin, N.,
Flavor-active compounds potentially implicated in cooked cauliflower acceptance,
J. Agric. Food Chem., 2002, 50, 22, 6459-6467, https://doi.org/10.1021/jf025579u
. [all data]
Cha, Kim, et al., 1998
Cha, Y.J.; Kim, H.; Cadwallader, K.R.,
Aroma-active compounds in Kimchi during fermentation,
J. Agric. Food Chem., 1998, 46, 5, 1944-1953, https://doi.org/10.1021/jf9706991
. [all data]
Blazevic and Mastelic, 2008
Blazevic, I.; Mastelic, J.,
Free and bounded volatiles of rocket (Eruca sativa Mill.),
Fravour Fragr. J., 2008, 23, 4, 278-285, https://doi.org/10.1002/ffj.1883
. [all data]
Breme, Langle, et al., 2008
Breme, K.; Langle, S.; Fernandez, X.; Meierhenrich, U.J.; Brevard, H.; Joulain, D.,
Character impact odorants from Brassicaceae by aroma extracts dilution analysis (AEDA): Brassica cretica and Brassica insularis,
Flavour Fragr. J., 2008, 24, 2, 88-93, https://doi.org/10.1002/ffj.1912
. [all data]
Valette, Fernandez, et al., 2006
Valette, L.; Fernandez, X.; Poulain, S.; Lizzani-Cuvelier, L.; Loiseau, A.-M.,
Chemical composition of the volatile extracts from Brassica oleracea L. var. botrytis 'Romanesco' cauliflower seeds,
Flavour Fragr. J., 2006, 21, 1, 107-110, https://doi.org/10.1002/ffj.1530
. [all data]
Bendimerad and Bendiab, 2005
Bendimerad, N.; Bendiab, S.A.T.,
Composition and antibacterial activity of Pseudocytisus integrifolius (Salisb.) essential oil from Algeria,
J. Agric. Food Chem., 2005, 53, 8, 2947-2952, https://doi.org/10.1021/jf047937u
. [all data]
Miyazawa, Nishiguchi, et al., 2005
Miyazawa, M.; Nishiguchi, T.; Yamafuji, C.,
Volatile components of the leaves of Brassica rapa L. var. perviridis Bailey,
Flavour Fragr. J., 2005, 20, 2, 158-160, https://doi.org/10.1002/ffj.1335
. [all data]
Rohloff and Bones, 2005
Rohloff, J.; Bones, A.M.,
Volatile profiling of Arabidopsis thaliana - Putative olfactory compounds in plant communication,
Phytochemistry, 2005, 66, 16, 1941-1955, https://doi.org/10.1016/j.phytochem.2005.06.021
. [all data]
Begnaud, Pérès, et al., 2003
Begnaud, F.; Pérès, C.; Berdagué, J.-L.,
Characterization of volatile effluents of livestock buildings by solid-phase microextraction,
Int. J. Environ. Anal. Chem., 2003, 83, 10, 837-849, https://doi.org/10.1080/03067310310001603349
. [all data]
Flath, Altieri, et al., 1984
Flath, R.A.; Altieri, M.A.; Mon, T.R.,
Volatile constituents of Amaranthus retroflexus L.,
J. Agric. Food Chem., 1984, 32, 1, 92-94, https://doi.org/10.1021/jf00121a024
. [all data]
Miyazawa, Maehara, et al., 2002
Miyazawa, M.; Maehara, T.; Kurose, K.,
Composition of the essential oil from the leaves of Eruca sativa,
Flavour Fragr. J., 2002, 17, 3, 187-190, https://doi.org/10.1002/ffj.1079
. [all data]