Trimethylindium
- Formula: C3H9In
- Molecular weight: 159.922
- IUPAC Standard InChIKey: IBEFSUTVZWZJEL-UHFFFAOYSA-N
- CAS Registry Number: 3385-78-2
- Chemical structure:
View 3d structure (requires JavaScript / HTML 5) - Other names: Indium, trimethyl-

Gas phase thermochemistry data

Data compiled by: José A. Martinho Simões
Quantity | Value | Units | Method | Reference | Comment |
---|---|---|---|---|---|
ΔfH°gas | 208.6 ± 9.9 | kJ/mol | Review | Martinho Simões |

Condensed phase thermochemistry data

Data compiled by: José A. Martinho Simões
Quantity | Value | Units | Method | Reference | Comment |
---|---|---|---|---|---|
ΔfH°solid | 160.1 ± 9.6 | kJ/mol | Review | Martinho Simões |

Phase change data

Data compiled as indicated in comments:
AC - William E. Acree, Jr., James S. Chickos
MS - José A. Martinho Simões
DH - Eugene S. Domalski and Elizabeth D. Hearing
Quantity | Value | Units | Method | Reference | Comment |
---|---|---|---|---|---|
ΔsubH° | 48.5 ± 2.5 | kJ/mol | N/A | Pilcher and Skinner, 1983 | See also Clark and Price, 1968.; AC |
ΔsubH° | 48.5 ± 2.5 | kJ/mol | RSC | Dennis, Work, et al., 1934 | MS |
Enthalpy of sublimation
ΔsubH (kJ/mol) | Temperature (K) | Method | Reference | Comment |
---|---|---|---|---|
62.7 | 294. | N/A | Fulem, Ruzicka, et al., 2004 | Based on data from 274. to 313. K.; AC |
57.7 | 344. | A | Stephenson and Malanowski, 1987 | Based on data from 328. to 362. K. See also Laubengayer and Gilliam, 1941.; AC |
Enthalpy of fusion
ΔfusH (kJ/mol) | Temperature (K) | Reference | Comment |
---|---|---|---|
14.300 | 358.7 | Ur'yash, Ronina, et al., 1991 | DH |
14.3 | 358.7 | Ur'yash, Ronina, et al., 1991, 2 | AC |

Reaction thermochemistry data

Data compiled by: José A. Martinho Simões
Individual Reactions
(l) + 3
(l) = Br3In (cr) + 3
(g)
By formula: C3H9In (l) + 3Br2 (l) = Br3In (cr) + 3CH3Br (g)
Quantity | Value | Units | Method | Reference | Comment |
---|---|---|---|---|---|
ΔrH° | -665.3 ± 4.2 | kJ/mol | RSC | Clarke and Price, 1968 | Please also see Pedley and Rylance, 1977 and Cox and Pilcher, 1970. |
(g) = C2H6In (g) +
(g)
By formula: C3H9In (g) = C2H6In (g) + CH4 (g)
Quantity | Value | Units | Method | Reference | Comment |
---|---|---|---|---|---|
ΔrH° | 205. to 218. | kJ/mol | N/A | Smith and Patrick, 1983 | |
ΔrH° | 205. ± 17. | kJ/mol | N/A | McMillen and Golden, 1982 |

References

Martinho Simões
Martinho Simões, J.A.,
Private communication (see http://webbook.nist.gov/chemistry/om/). [all data]
Pilcher and Skinner, 1983
Pilcher, G.; Skinner, H.A.,
Thermochemistry of organometallic compounds, 1983, 43-90, https://doi.org/10.1002/9780470771686.ch2
. [all data]
Clark and Price, 1968
Clark, W.D.; Price, S.J.W.,
Determination of the heat of formation of trimethylindium and calculation of the mean In---CH 3 bond dissociation energy,
Can. J. Chem., 1968, 46, 10, 1633-1634, https://doi.org/10.1139/v68-272
. [all data]
Dennis, Work, et al., 1934
Dennis, L.M.; Work, R.W.; Rochow, E.G.; Chamot, E.M.,
J. Am. Chem. Soc., 1934, 56, 1047. [all data]
Fulem, Ruzicka, et al., 2004
Fulem, M.; Ruzicka, K.; Ruzicka, V.; Hulicius, E.; Simecek, T.; Pangrác, J.; Rushworth, S.A.; Smith, L.M.,
Measurement of vapour pressure of In-based metalorganics for MOVPE,
Journal of Crystal Growth, 2004, 272, 1-4, 42-46, https://doi.org/10.1016/j.jcrysgro.2004.09.001
. [all data]
Stephenson and Malanowski, 1987
Stephenson, Richard M.; Malanowski, Stanislaw,
Handbook of the Thermodynamics of Organic Compounds, 1987, https://doi.org/10.1007/978-94-009-3173-2
. [all data]
Laubengayer and Gilliam, 1941
Laubengayer, A.W.; Gilliam, W.F.,
The Alkyls of the Third Group Elements. I. Vapor Phase Studies of the Alkyls of Aluminum, Gallium and Indium 1,
J. Am. Chem. Soc., 1941, 63, 2, 477-479, https://doi.org/10.1021/ja01847a031
. [all data]
Ur'yash, Ronina, et al., 1991
Ur'yash, V.F.; Ronina, O.V.; Karataev, E.N.; Zimina, I.D.,
Physicochemical study of alkyl derivatives of indium,
Metalloorg. Khim., 1991, 4(5), 1050-1054. [all data]
Ur'yash, Ronina, et al., 1991, 2
Ur'yash, V.F.; Ronina, O.V.; Karataev, E.N.; Zimina, I.V.; Kuznetsova, T.V.; Petrun, T.V.; Feshchenko, I.A.; Zorin, A.D.,
Physicochemical study of alkyl derivatives of indium,
Metalloogranicheskaya Khimiya, 1991, 4, 5, 1050. [all data]
Clarke and Price, 1968
Clarke, W.D.; Price, S.J.W.,
Can. J. Chem., 1968, 46, 1633. [all data]
Pedley and Rylance, 1977
Pedley, J.B.; Rylance, J.,
Computer Analysed Thermochemical Data: Organic and Organometallic Compounds, University of Sussex, Brigton, 1977. [all data]
Cox and Pilcher, 1970
Cox, J.D.; Pilcher, G.,
Thermochemistry of Organic and Organometallic Compounds
in Academic Press, New York, 1970. [all data]
Smith and Patrick, 1983
Smith, G.P.; Patrick, R.,
Int. J. Chem. Kinet., 1983, 15, 167. [all data]
McMillen and Golden, 1982
McMillen, D.F.; Golden, D.M.,
Hydrocarbon bond dissociation energies,
Ann. Rev. Phys. Chem., 1982, 33, 493. [all data]