Dibenzo[b,E][1,4]dioxin, 2,7-dichloro-
- Formula: C12H6Cl2O2
- Molecular weight: 253.081
- IUPAC Standard InChIKey: NBFMTHWVRBOVPE-UHFFFAOYSA-N
- CAS Registry Number: 33857-26-0
- Chemical structure:
View 3d structure (requires JavaScript / HTML 5) - Other names: Dibenzo-p-dioxin, 2,7-dichloro-; 2,7-Dichlorodibenzo-p-dioxin; 2,7-Dichlorodibenzodioxin; Dcdd; NCI-C03667; 2,7-Dichlorodibenzo[b,e] [1,4]dioxin

Phase change data

Data compiled by: William E. Acree, Jr., James S. Chickos
Enthalpy of sublimation
ΔsubH (kJ/mol) | Temperature (K) | Method | Reference | Comment |
---|---|---|---|---|
113.8 ± 2.0 | 375. | ME | Li, Shibata, et al., 2004 | Based on data from 358. to 393. K. |
105.5 | 344. | T | Rordorf, 1989 | Based on data from 314. to 374. K. See also Rordorf, 1986. |

Henry's Law data

Data compiled by: Rolf Sander

Henry's Law constant (water solution)

kH(T) = H exp(d(ln(kH))/d(1/T) ((1/T) - 1/(298.15 K)))
H = Henry's law constant for solubility in water at 298.15 K (mol/(kg*bar))
d(ln(kH))/d(1/T) = Temperature dependence constant (K)

H (mol/(kg*bar)) d(ln(kH))/d(1/T) (K) Method Reference Comment
17. MN/A
12. XShiu, Doucette, et al., 1988Value given here as quoted by missing citation.

References

Li, Shibata, et al., 2004
Li, Xian-Wei; Shibata, Etsuro; Kasai, Eiki; Nakamura, Takashi,
VAPOR PRESSURES AND ENTHALPIES OF SUBLIMATION OF 17 POLYCHLORINATED DIBENZO-p-DIOXINS AND FIVE POLYCHLORINATED DIBENZOFURANS,
Environ Toxicol Chem, 2004, 23, 2, 348-808, https://doi.org/10.1897/03-193
. [all data]
Rordorf, 1989
Rordorf, Berchtold F.,
Prediction of vapor pressures, boiling points and enthalpies of fusion for twenty-nine halogenated dibenzo-p-dioxins and fifty-five dibenzofurans by a vapor pressure correlation method,
Chemosphere, 1989, 18, 1-6, 783-788, https://doi.org/10.1016/0045-6535(89)90196-3
. [all data]
Rordorf, 1986
Rordorf, Berchtold F.,
Thermal properties of dioxins, furans and related compounds,
Chemosphere, 1986, 15, 9-12, 1325-1332, https://doi.org/10.1016/0045-6535(86)90407-8
. [all data]