1,3-dodecadiene

Phase change data

Data compiled by: Thermodynamics Research Center, NIST Boulder Laboratories, Chris Muzny director

Quantity Value Units Method Reference Comment
Tfus221.KN/AZiegler, Spath, et al., 1942Uncertainty assigned by TRC = 2. K

In addition to the Thermodynamics Research Center (TRC) data available from this site, much more physical and chemical property data is available from the following TRC products:

References

Ziegler, Spath, et al., 1942
Ziegler, K.; Spath, A.; Schaaf, E.; Schumann, W.; Winkelman, E., Halogenation of Unsaturated Substances in the Allyl Postion, Justus Liebigs Ann. Chem., 1942, 551, 80-119. [all data]