(-)-Deoxyephedrine
- Formula: C10H15N
- Molecular weight: 149.2328
- IUPAC Standard InChIKey: MYWUZJCMWCOHBA-VIFPVBQESA-N
- CAS Registry Number: 33817-09-3
- Chemical structure:
View 3d structure (requires JavaScript / HTML 5) - Stereoisomers:
- Other names: Levmetamfetamine; Benzeneethanamine, N,α-dimethyl-, (R)-; (-)-Methamphetamine; L-methamphetamine; L-methylamphetamine; Benzeneethanamine, N,α-dimethyl-, (-)-; Phenethylamine, N,α-dimethyl-, (-)-; R-(-)-N-Methylamphetamine; l-1-Phenyl-2-methylamino-propan; l-1-Phenyl-2-methylaminopropane; (-)-(R)-N,α-Dimethylphenethylamine; N-Methyl-1-phenyl-2-propanamine, (-)-; NSC 6084; Phenethylamine, N,α-dimethyl-, D-; N-Methyl-1-phenyl-2-propanamine; D-(-)-n,alpha-dimethyl-phenyl ethylamine; Laevo desoxyephedrine base; (-)-methyl(α-methylphenethyl)amine

Van Den Dool and Kratz RI, non-polar column, custom temperature program

Column type | Active phase | I | Reference | Comment |
---|---|---|---|---|
Capillary | VF-5MS | 1203.6 | Tret'yakov, 2008 | 30. m/0.25 mm/0.25 μm, He; Program: Multi-step temperature program; T(initial)=60C; T(final)=270C |

References

Tret'yakov, 2008
Tret'yakov, K.V.,
Retention Data. NIST Mass Spectrometry Data Center., NIST Mass Spectrometry Data Center, 2008. [all data]