Benzenemethanamine, N-(1,1-dimethylethyl)-
- Formula: C11H17N
- Molecular weight: 163.2594
- IUPAC Standard InChIKey: DLSOILHAKCBARI-UHFFFAOYSA-N
- CAS Registry Number: 3378-72-1
- Chemical structure:
View 3d structure (requires JavaScript / HTML 5) - Other names: tert-Butylbenzylamine; N-tert-Butylbenzylamine; N-Benzyl-tert-butylamine; N-t-Butylbenzylamine

Phase change data

Data compiled by: Robert L. Brown and Stephen E. Stein
Reduced pressure boiling point
Tboil (K) | Pressure (bar) | Reference |
---|---|---|
353.2 | 0.007 | Aldrich Chemical Company Inc., 1990 |
373. to 375. | 0.023 | Frinton Laboratories Inc., 1986 |

References

Aldrich Chemical Company Inc., 1990
Aldrich Chemical Company Inc.,
Catalog Handbook of Fine Chemicals, Aldrich Chemical Company, Inc., Milwaukee WI, 1990, 1. [all data]
Frinton Laboratories Inc., 1986
Frinton Laboratories Inc.,
Catalog Number 11, Frinton Laboratories Inc., Vineland, NJ, 1986, 99. [all data]