N-chloro-N-1,2,2,2-pentafluoro-1-(trifluoromethyl)ethylamine

Phase change data

Data compiled by: William E. Acree, Jr., James S. Chickos

Enthalpy of vaporization

ΔvapH (kJ/mol) Temperature (K) Method Reference Comment
28.8255.AStephenson and Malanowski, 1987Based on data from 240. - 311. K. See also Shreeve, Swindell, et al., 1971.

References

Stephenson and Malanowski, 1987
Stephenson, Richard M.; Malanowski, Stanislaw, Handbook of the Thermodynamics of Organic Compounds, 1987, https://doi.org/10.1007/978-94-009-3173-2 . [all data]

Shreeve, Swindell, et al., 1971
Shreeve, Jean'ne M.; Swindell, Richard; Zaborowski, L.M., Chlorine monofluoride addition to halo imines. Magnetic nonequivalence in some perfluoroamines, Inorg. Chem., 1971, 10, 8, 1635-1638, https://doi.org/10.1021/ic50102a019 . [all data]