N,1-dichloro-N,1,1-trifluoromethylamine

Phase change data

Data compiled by: William E. Acree, Jr., James S. Chickos

Enthalpy of vaporization

ΔvapH (kJ/mol) Temperature (K) Reference Comment
26.4258.Shreeve, Swindell, et al., 1971Based on data from 226. - 291. K.

References

Shreeve, Swindell, et al., 1971
Shreeve, Jean'ne M.; Swindell, Richard; Zaborowski, L.M., Chlorine monofluoride addition to halo imines. Magnetic nonequivalence in some perfluoroamines, Inorg. Chem., 1971, 10, 8, 1635-1638, https://doi.org/10.1021/ic50102a019 . [all data]