Thallium hexadecanoate

Phase change data

Data compiled by: Eugene S. Domalski and Elizabeth D. Hearing

Enthalpy of phase transition

ΔHtrs (kJ/mol) Temperature (K) Initial Phase Final Phase Reference Comment
1.381450.liquidliquidMeisel, Seybold, et al., 1976
10.878327.crystaline, IIcrystaline, IMeisel, Seybold, et al., 1976
8.786390.crystaline, IliquidMeisel, Seybold, et al., 1976

Entropy of phase transition

ΔStrs (J/mol*K) Temperature (K) Initial Phase Final Phase Reference Comment
3.05450.liquid, Mesophaseliquid, isotropicMeisel, Seybold, et al., 1976
33.5327.crystaline, IIcrystaline, IMeisel, Seybold, et al., 1976
22.2390.crystaline, I, Solidliquid, mesophaseMeisel, Seybold, et al., 1976

References

Meisel, Seybold, et al., 1976
Meisel, T.; Seybold, K.; Halmos, Z.; Roth, J.; Melykuti, C., Thermal behavior of thallium(I) fatty acid salts. I, J. Therm. Anal., 1976, 10, 419-431. [all data]