Benzene, p-di-tert-pentyl-
- Formula: C16H26
- Molecular weight: 218.3776
- IUPAC Standard InChIKey: KNLFZJBLNQRLEL-UHFFFAOYSA-N
- CAS Registry Number: 3373-10-2
- Chemical structure:
View 3d structure (requires JavaScript / HTML 5) - Other names: 1,4-Di-tert-pentylbenzene; p-di-tert-pentylbenzene

Phase change data

Data compiled by: Thermodynamics Research Center, NIST Boulder Laboratories, Chris Muzny director
Quantity | Value | Units | Method | Reference | Comment |
---|---|---|---|---|---|
Tboil | 545.31 | K | N/A | Anonymous, 1962 | Uncertainty assigned by TRC = 0.4 K |
Tboil | 533.15 | K | N/A | O'Connor and Sowa, 1938 | Uncertainty assigned by TRC = 2. K |
Quantity | Value | Units | Method | Reference | Comment |
Tfus | 292.89 | K | N/A | Anonymous, 1962 | Uncertainty assigned by TRC = 0.2 K |

References

Anonymous, 1962
Anonymous, R.,
, Am. Pet. Inst. Res. Proj. 58A, Annu. Rep., 1962. [all data]
O'Connor and Sowa, 1938
O'Connor, M.J.; Sowa, F.J.,
Organic Reactions with Boron Fluoride XVIII. The Reaction of ethers with Benzene,
J. Am. Chem. Soc., 1938, 60, 125. [all data]