(Z)-CH3CH=CHCH2COOH
- Formula: C5H8O2
- Molecular weight: 100.1158
- IUPAC Standard InChIKey: UIUWNILCHFBLEQ-IHWYPQMZSA-N
- CAS Registry Number: 33698-87-2
- Chemical structure:
View 3d structure (requires JavaScript / HTML 5) - Stereoisomers:
- Other names: cis-Beta,gamma-penteneoic acid

Condensed phase thermochemistry data

Data compiled by: Hussein Y. Afeefy, Joel F. Liebman, and Stephen E. Stein
Quantity | Value | Units | Method | Reference | Comment |
---|---|---|---|---|---|
ΔcH°liquid | -4034. | kJ/mol | Cm | Schjanberg, 1938 | Corresponding ΔfHºliquid = 923.4 kJ/mol (simple calculation by NIST; no Washburn corrections) |

Phase change data

Data compiled by: Thermodynamics Research Center, NIST Boulder Laboratories, Chris Muzny director
Quantity | Value | Units | Method | Reference | Comment |
---|---|---|---|---|---|
Tc | 646.87 | K | N/A | D'Souza and Teja, 1987 | Uncertainty assigned by TRC = 3. K; Ambrose's procedure |
Quantity | Value | Units | Method | Reference | Comment |
Pc | 38.7866 | bar | N/A | D'Souza and Teja, 1987 | Uncertainty assigned by TRC = 1.00 bar; Ambrose's procedure |

References

Schjanberg, 1938
Schjanberg, E.,
Cis-pentensyreetylestrarnas forbranningsvarmen, refraktionsdata och alkaliska hydrolys,
Svensk. Kim. Tidr., 1938, 50, 102-106. [all data]
D'Souza and Teja, 1987
D'Souza, R.; Teja, A.S.,
The prediction of the vapor pressures of carboxylic acids,
Chem. Eng. Commun., 1987, 61, 13. [all data]