3-Methoxypropionitrile
- Formula: C4H7NO
- Molecular weight: 85.1045
- IUPAC Standard InChIKey: OOWFYDWAMOKVSF-UHFFFAOYSA-N
- CAS Registry Number: 33695-59-9
- Chemical structure:
View 3d structure (requires JavaScript / HTML 5) - Species with the same structure:

Condensed phase thermochemistry data

Data compiled by: Hussein Y. Afeefy, Joel F. Liebman, and Stephen E. Stein
Quantity | Value | Units | Method | Reference | Comment |
---|---|---|---|---|---|
ΔfH°liquid | -116.9 ± 0.4 | kJ/mol | Ccb | Gutner, Lebedeva, et al., 1980 | |
Quantity | Value | Units | Method | Reference | Comment |
ΔcH°liquid | -2457.5 ± 0.4 | kJ/mol | Ccb | Gutner, Lebedeva, et al., 1980 |

Phase change data

Data compiled by: William E. Acree, Jr., James S. Chickos
Enthalpy of vaporization
ΔvapH (kJ/mol) | Temperature (K) | Method | Reference | Comment |
---|---|---|---|---|
47.6 | 343. | A | Stephenson and Malanowski, 1987 | Based on data from 328. to 438. K. |

References

Gutner, Lebedeva, et al., 1980
Gutner, N.M.; Lebedeva, N.D.; Dobychin, S.L.; Kiseleva, N.N.,
Thermochemical study of aliphatic ethers,
J. Appl. Chem. USSR, 1980, 53, 1523-1525. [all data]
Stephenson and Malanowski, 1987
Stephenson, Richard M.; Malanowski, Stanislaw,
Handbook of the Thermodynamics of Organic Compounds, 1987, https://doi.org/10.1007/978-94-009-3173-2
. [all data]