Terbumeton

Kovats' RI, polar column, isothermal

View large format table.

Column type Active phase Temperature (C) I Reference Comment
PackedCarbowax 20M215.2570.Leclercq and Pacáková, 1979N2, Chromosorb W
PackedCarbowax 20M190.2598.Matisová, Krupcík, et al., 1979N2, Chromosorb W AW (80-100 mesh); Column length: 1.3 m
PackedCarbowax 20M215.2570.Pacáková and Nemec, 1978N2, Chromosorb W; Column length: 1.4 m

References

Leclercq and Pacáková, 1979
Leclercq, P.A.; Pacáková, V., Gas Chromatography and Mass Spectrometry of Bis(alkylamino)-s-triazines, J. Chromatogr., 1979, 178, 1, 193-207, https://doi.org/10.1016/S0021-9673(00)89708-3 . [all data]

Matisová, Krupcík, et al., 1979
Matisová, E.; Krupcík, J.; Líska, O.; Szentiványi, N., Qualitative analysis of multi-component s-triazine herbicides by gas-liquid chromatography, J. Chromatogr., 1979, 169, 261-269, https://doi.org/10.1016/0021-9673(75)85049-7 . [all data]

Pacáková and Nemec, 1978
Pacáková, V.; Nemec, I., Gas chromatographic, spectrophotometric and electrochemical behaviour of subsitituted s-triazines, J. Chromatogr., 1978, 148, 1, 273-281, https://doi.org/10.1016/S0021-9673(00)99348-8 . [all data]