Benzenemethanol, α-(1-methyl-1-nitroethyl)-
- Formula: C10H13NO3
- Molecular weight: 195.2151
- IUPAC Standard InChIKey: HZYOZOFLFAXDFR-UHFFFAOYSA-N
- CAS Registry Number: 33687-74-0
- Chemical structure:
View 3d structure (requires JavaScript / HTML 5) - Permanent link for this species. Use this link for bookmarking this species for future reference.

Condensed phase thermochemistry data

Data compiled by: Hussein Y. Afeefy, Joel F. Liebman, and Stephen E. Stein
Quantity | Value | Units | Method | Reference | Comment |
---|---|---|---|---|---|
ΔfH°solid | -317.5 ± 5.9 | kJ/mol | Ccb | Currie, Bennett, et al., 1952 | |
ΔfH°solid | -317.5 ± 5.9 | kJ/mol | Ccb | Currie, 1950 | |
Quantity | Value | Units | Method | Reference | Comment |
ΔcH°solid | -5475.6 ± 5.9 | kJ/mol | Ccb | Currie, Bennett, et al., 1952 | |
ΔcH°solid | -5475.6 ± 5.9 | kJ/mol | Ccb | Currie, 1950 |

References

Currie, Bennett, et al., 1952
Currie, R.M.; Bennett, C.O.; Holcomb, D.E.,
Heats of combustion of some nitro alcohols,
Ind. Eng. Chem., 1952, 44, 329-331. [all data]
Currie, 1950
Currie, R.M.,
Heats of combustion of some nitroalcohols, Thesis for Purdue University, 1950, 1-84. [all data]