Heptafluorobutyric anhydride
- Formula: C8F14O3
- Molecular weight: 410.0614
- IUPAC Standard InChIKey: UFFSXJKVKBQEHC-UHFFFAOYSA-N
- CAS Registry Number: 336-59-4
- Chemical structure:
View 3d structure (requires JavaScript / HTML 5) - Other names: Heptafluorobutanoic anhydride; Perfluorobutyric anhydride; Heptafluoro-n-butyric anhydride; Butanoic acid, heptafluoro-, anhydride

Phase change data

Data compiled by: Robert L. Brown and Stephen E. Stein
Quantity | Value | Units | Method | Reference | Comment |
---|---|---|---|---|---|
Tboil | 382.2 | K | N/A | Aldrich Chemical Company Inc., 1990 | |
Tboil | 381. to 383. | K | N/A | Farchan Laboratories, 1990 | |
Tboil | 379. to 380. | K | N/A | PCR Inc., 1990 |

References

Aldrich Chemical Company Inc., 1990
Aldrich Chemical Company Inc.,
Catalog Handbook of Fine Chemicals, Aldrich Chemical Company, Inc., Milwaukee WI, 1990, 1. [all data]
Farchan Laboratories, 1990
Farchan Laboratories,
Research Chemicals Catalog, Farchan Laboratories, Gainesville, FL, 1990, 91. [all data]
PCR Inc., 1990
PCR Inc.,
Research Chemicals Catalog 1990-1991, PCR Inc., Gainesville, FL, 1990, 1. [all data]