sulphinylbis(diethylamide)
- Formula: C8H20N2OS
- Molecular weight: 192.322
- IUPAC Standard InChIKey: BVVRZSKVUVJJAJ-UHFFFAOYSA-N
- CAS Registry Number: 33641-61-1
- Chemical structure:
View 3d structure (requires JavaScript / HTML 5) - Other names: Tetraethyl sulphurous diamide

Condensed phase thermochemistry data

Data compiled by: Hussein Y. Afeefy, Joel F. Liebman, and Stephen E. Stein
Quantity | Value | Units | Method | Reference | Comment |
---|---|---|---|---|---|
ΔfH°liquid | -322.6 ± 8.1 | kJ/mol | Cm | Claydon and Mortimer, 1962 | Reanalyzed by Cox and Pilcher, 1970, Original value = -316. ± 7.1 kJ/mol |

Reaction thermochemistry data

Data compiled by: Hussein Y. Afeefy, Joel F. Liebman, and Stephen E. Stein
Individual Reactions
By formula: C8H20N2OS + 2C4H12ClN = 4C4H11N + Cl2OS
Quantity | Value | Units | Method | Reference | Comment |
---|---|---|---|---|---|
ΔrH° | 379.5 ± 4.2 | kJ/mol | Cm | Claydon and Mortimer, 1962 | liquid phase; Reanalyzed by Cox and Pilcher, 1970, Original value = 393. ± 4.2 kJ/mol |

References

Claydon and Mortimer, 1962
Claydon, A.P.; Mortimer, C.T.,
Heats of formation and bond energies. Part VIII. Diethylaminotrimethylsilane, NN'-dithiodiethylamine, NN'-thionylbisdiethylamine, and NN'-sulphurylbisdiethylamine,
J. Chem. Soc., 1962, 3212-3216. [all data]
Cox and Pilcher, 1970
Cox, J.D.; Pilcher, G.,
Thermochemistry of Organic and Organometallic Compounds, Academic Press, New York, 1970, 1-636. [all data]