(-)-trans-Pinane
- Formula: C10H18
- Molecular weight: 138.2499
- IUPAC Standard InChIKey: XOKSLPVRUOBDEW-HRDYMLBCSA-N
- CAS Registry Number: 33626-25-4
- Chemical structure:
View 3d structure (requires JavaScript / HTML 5) - Stereoisomers:
- Other names: 2,6,6-Trimethyl-bicyclo[3.1.1]heptane, trans; E-pinane; Pinane, trans; trans-Pinane; 2,6,6-Trimethylbicyclo[3.1.1]heptane, (1α,2α,5α)

Phase change data

Data compiled by: Thermodynamics Research Center, NIST Boulder Laboratories, Chris Muzny director
Quantity | Value | Units | Method | Reference | Comment |
---|---|---|---|---|---|
Tboil | 436.4 | K | N/A | Chiurdoglu, Decot, et al., 1954 | Uncertainty assigned by TRC = 3. K |

References

Chiurdoglu, Decot, et al., 1954
Chiurdoglu, G.; Decot, J.; Van Lancker-Francotte,
Equilibrium of Isomerization Cyclic Hydrocarbons VI. Isomerism and Isomeriztion of cis- and trans-pinanes,
Bull. Soc. Chim. Belg., 1954, 63, 70. [all data]