3,5,7,9,10-Pentachloro-2,2,3,4,4,5,6,6,7,8,8,9,10,10-tetradecafluorodecanoic acid
- Formula: C10HCl5F14O2
- Molecular weight: 596.356
- IUPAC Standard InChIKey: ADMOCDJEQJUWJY-UHFFFAOYSA-N
- CAS Registry Number: 335-74-0
- Chemical structure:

Phase change data

Data compiled by: William E. Acree, Jr., James S. Chickos
Enthalpy of vaporization
ΔvapH (kcal/mol) | Temperature (K) | Method | Reference | Comment |
---|---|---|---|---|
19.3 | 388. | A | Stephenson and Malanowski, 1987 | Based on data from 373. to 578. K. See also Barnhart, Seffl, et al., 1957 and Dykyj, Svoboda, et al., 1999. |

References

Stephenson and Malanowski, 1987
Stephenson, Richard M.; Malanowski, Stanislaw,
Handbook of the Thermodynamics of Organic Compounds, 1987, https://doi.org/10.1007/978-94-009-3173-2
. [all data]
Barnhart, Seffl, et al., 1957
Barnhart, W.S.; Seffl, R.J.; Wade, R.H.; West, F.W.; Zollinger, J.L.,
Physical and Chemical Properties of a New Series of Carboxylic Acids, Cl (CF 2 CFCl) x CF 2 CO 2 H.,
Ind. Eng. Chem. Chem. Eng. Data Series, 1957, 2, 1, 80-83, https://doi.org/10.1021/i460002a023
. [all data]
Dykyj, Svoboda, et al., 1999
Dykyj, J.; Svoboda, J.; Wilhoit, R.C.; Frenkel, M.L.; Hall, K.R.,
Vapor Pressure of Chemicals: Part A. Vapor Pressure and Antoine Constants for Hydrocarbons and Sulfur, Selenium, Tellurium and Hydrogen Containing Organic Compounds, Springer, Berlin, 1999, 373. [all data]