3-(2-Hydroxyethyl)-2-oxazolidinone
- Formula: C5H9NO3
- Molecular weight: 131.1299
- IUPAC Standard InChIKey: GOXNUYXRIQJIEF-UHFFFAOYSA-N
- CAS Registry Number: 3356-88-5
- Chemical structure:
View 3d structure (requires JavaScript / HTML 5) - Other names: 3-(2'-Hydroxyethyl)-2-oxazolidone; N-Hydroxyethyl-2-oxazolidone; 2-Oxazolidinone, 3-(2-hydroxyethyl)-

Phase change data

Data compiled by: Robert L. Brown and Stephen E. Stein
Reduced pressure boiling point
Tboil (K) | Pressure (bar) | Reference |
---|---|---|
435. | 0.001 | Frinton Laboratories Inc., 1986 |

References

Frinton Laboratories Inc., 1986
Frinton Laboratories Inc.,
Catalog Number 11, Frinton Laboratories Inc., Vineland, NJ, 1986, 99. [all data]