Pentadecafluorooctanoic acid
- Formula: C8HF15O2
- Molecular weight: 414.0684
- IUPAC Standard InChIKey: SNGREZUHAYWORS-UHFFFAOYSA-N
- CAS Registry Number: 335-67-1
- Chemical structure:
View 3d structure (requires JavaScript / HTML 5) - Other names: Octanoic acid, pentadecafluoro-; Pentadecafluoro-1-octanoic acid; Perfluorocaprylic acid; Perfluoroheptanecarboxylic acid; Perfluorooctanoic acid; Perfluoro-n-octanoic acid; Hexanoyl fluoride, 3,3,4,4,5,5,6,6,6-nonafluoro-2-oxo-; Pentadecafluoro-n-octanoic acid; Perfluoroctanoic acid; PFOA; n-Perfluorooctanoic acid; NSC 95114; Octanoic acid, 2,2,3,3,4,4,5,5,6,6,7,7,8,8,8-pentadecafluoro-; 2,2,3,3,4,4,5,5,6,6,7,7,8,8,8-Pentadecafluorooctanoic acid; Fluorad FC-26; 65618-66-8; 71244-15-0; Fluorad FC-26 (Salt/Mix)

Phase change data

Data compiled as indicated in comments:
BS - Robert L. Brown and Stephen E. Stein
AC - William E. Acree, Jr., James S. Chickos
Reduced pressure boiling point
Tboil (K) | Pressure (bar) | Reference | Comment |
---|---|---|---|
462.2 | 0.981 | Aldrich Chemical Company Inc., 1990 | BS |
462. | 0.981 | PCR Inc., 1990 | BS |
Enthalpy of sublimation
ΔsubH (kJ/mol) | Temperature (K) | Method | Reference | Comment |
---|---|---|---|---|
88.9 | 298. to 318. | GS | Barton, Botelho, et al., 2008 | AC |

Van Den Dool and Kratz RI, non-polar column, custom temperature program

Column type | Active phase | I | Reference | Comment |
---|---|---|---|---|
Capillary | VF-5MS | 1045. | Tretyakov, 2011 | 30. m/0.25 mm/0.25 μm, He; Program: Multi-step temperature program; T(initial)=60C; T(final)=270C |

References

Aldrich Chemical Company Inc., 1990
Aldrich Chemical Company Inc.,
Catalog Handbook of Fine Chemicals, Aldrich Chemical Company, Inc., Milwaukee WI, 1990, 1. [all data]
PCR Inc., 1990
PCR Inc.,
Research Chemicals Catalog 1990-1991, PCR Inc., Gainesville, FL, 1990, 1. [all data]
Barton, Botelho, et al., 2008
Barton, Catherine A.; Botelho, Miguel A.; Kaiser, Mary A.,
Solid Vapor Pressure and Enthalpy of Sublimation for Perfluorooctanoic Acid,
J. Chem. Eng. Data, 2008, 53, 4, 939-941, https://doi.org/10.1021/je700593d
. [all data]
Tretyakov, 2011
Tretyakov, K.V.,
Retention Data. NIST Mass Spectrometry Data Center., NIST Mass Spectrometry Data Center, 2011. [all data]