1H-Perfluorooctane
- Formula: C8HF17
- Molecular weight: 420.0664
- IUPAC Standard InChIKey: KBHBUUBXEQUIMV-UHFFFAOYSA-N
- CAS Registry Number: 335-65-9
- Chemical structure:
View 3d structure (requires JavaScript / HTML 5) - Other names: 1,1,1,2,2,3,3,4,4,5,5,6,6,7,7,8,8-heptadecafluorooctane

Kovats' RI, non-polar column, isothermal

Column type | Active phase | Temperature (C) | I | Reference | Comment |
---|---|---|---|---|---|
Packed | Squalane | 50. | 395. | Müller, Dietrich, et al., 1983 |

References

Müller, Dietrich, et al., 1983
Müller, U.; Dietrich, P.; Prescher, D.,
Gaschromatographische Untersuchungen an Perfluor-Carbonverbindungen. II. Zur Gaschromatographischen Trennung von Gemischen Längerkettiger Perfluoralkane und Perfluoralkene,
J. Chromatogr., 1983, 259, 243-254, https://doi.org/10.1016/S0021-9673(01)88005-5
. [all data]