Thiourea-cyclohexane adduct

Condensed phase thermochemistry data

Data compiled by: Eugene S. Domalski and Elizabeth D. Hearing

Quantity Value Units Method Reference Comment
solid,1 bar173.0J/mol*KN/ACope, Gannon, et al., 1972crystaline, I phase; Does not include possible zero-point entropy.

Constant pressure heat capacity of solid

Cp,solid (J/mol*K) Temperature (K) Reference Comment
139.1298.15Cope, Gannon, et al., 1972crystaline, I phase; T = 14 to 297 K. Values for one mole of thiourea.

References

Cope, Gannon, et al., 1972
Cope, A.F.G.; Gannon, D.J.; Parsonage, N.G., Thermodynamic properties of thiourea + hydrocarbon adducts from 12 to 300K. The heat capacities and entropies of the adducts of c-C6H12, c-C7H14, c-C8H16, and (CH3)3C.C2H5, J. Chem. Thermodynam., 1972, 4, 829-842. [all data]