C10H8N2O

Reaction thermochemistry data

Data compiled by: John E. Bartmess

Individual Reactions

C10H7N2O- + Hydrogen cation = C10H8N2O

By formula: C10H7N2O- + H+ = C10H8N2O

Quantity Value Units Method Reference Comment
Δr1320. ± 8.4kJ/molIMREKoppel, Taft, et al., 1994gas phase

References

Koppel, Taft, et al., 1994
Koppel, I.A.; Taft, R.W.; Anvia, F.; Zhu, S.Z.; Hu, L.Q.; Sung, K.S.; Desmarteau, D.D.; Yagupolskii, L.M., The Gas-Phase Acidities of Very Strong Neutral Bronsted Acids, J. Am. Chem. Soc., 1994, 116, 7, 3047, https://doi.org/10.1021/ja00086a038 . [all data]