Cyclononanone
- Formula: C9H16O
- Molecular weight: 140.2227
- IUPAC Standard InChIKey: BAUZLFKYYIVGPM-UHFFFAOYSA-N
- CAS Registry Number: 3350-30-9
- Chemical structure:
View 3d structure (requires JavaScript / HTML 5) - Permanent link for this species. Use this link for bookmarking this species for future reference.

Gas phase thermochemistry data

Data compiled by: Hussein Y. Afeefy, Joel F. Liebman, and Stephen E. Stein
Quantity | Value | Units | Method | Reference | Comment |
---|---|---|---|---|---|
ΔfH°gas | -279.7 ± 1.7 | kJ/mol | Ccb | Wolf, 1972 | Hfusion=0.498±0.020 kcal/mol |

Condensed phase thermochemistry data

Data compiled by: Hussein Y. Afeefy, Joel F. Liebman, and Stephen E. Stein
Quantity | Value | Units | Method | Reference | Comment |
---|---|---|---|---|---|
ΔfH°solid | -334.9 ± 1.6 | kJ/mol | Ccb | Wolf, 1972 | Hfusion=0.498±0.020 kcal/mol |
Quantity | Value | Units | Method | Reference | Comment |
ΔcH°solid | -5493.4 ± 1.5 | kJ/mol | Ccb | Wolf, 1972 | Hfusion=0.498±0.020 kcal/mol; Corresponding ΔfHºsolid = -334.81 kJ/mol (simple calculation by NIST; no Washburn corrections) |

Phase change data

Data compiled as indicated in comments:
TRC - Thermodynamics Research Center, NIST Boulder Laboratories, Chris Muzny director
BS - Robert L. Brown and Stephen E. Stein
AC - William E. Acree, Jr., James S. Chickos
CAL - James S. Chickos, William E. Acree, Jr., Joel F. Liebman, Students of Chem 202 (Introduction to the Literature of Chemistry), University of Missouri -- St. Louis
Quantity | Value | Units | Method | Reference | Comment |
---|---|---|---|---|---|
Tboil | 493.6 | K | N/A | Wolf, 1972, 2 | Uncertainty assigned by TRC = 1.5 K; TRC |
Quantity | Value | Units | Method | Reference | Comment |
Tfus | 305.1 | K | N/A | Wolf, 1972, 2 | Uncertainty assigned by TRC = 2. K; TRC |
Quantity | Value | Units | Method | Reference | Comment |
ΔvapH° | 53.1 ± 0.6 | kJ/mol | N/A | Wolf, 1972 | AC |
Quantity | Value | Units | Method | Reference | Comment |
ΔfusH° | 1.6 | kJ/mol | N/A | Gonthier-Vassal and Szwarc, 1998 | AC |
Reduced pressure boiling point
Tboil (K) | Pressure (bar) | Reference | Comment |
---|---|---|---|
369.2 | 0.024 | Aldrich Chemical Company Inc., 1990 | BS |
367.2 | 0.016 | Weast and Grasselli, 1989 | BS |
Enthalpy of vaporization
ΔvapH (kJ/mol) | Temperature (K) | Method | Reference | Comment |
---|---|---|---|---|
51.4 | 348. | A | Stephenson and Malanowski, 1987 | Based on data from 333. to 413. K.; AC |
Entropy of fusion
ΔfusS (J/mol*K) | Temperature (K) | Reference | Comment |
---|---|---|---|
59.5 | 247. | Gonthier-Vassal and Szwarc, 1998, 2 | CAL |
5.4 | 298. |

Gas phase ion energetics data

Data evaluated by: Edward P. Hunter and Sharon G. Lias
Quantity | Value | Units | Method | Reference | Comment |
---|---|---|---|---|---|
Proton affinity (review) | 852.6 | kJ/mol | N/A | Hunter and Lias, 1998 | |
Quantity | Value | Units | Method | Reference | Comment |
Gas basicity | 822.8 | kJ/mol | N/A | Hunter and Lias, 1998 |

Normal alkane RI, non-polar column, temperature ramp

Column type | Active phase | I | Reference | Comment |
---|---|---|---|---|
Capillary | DB-5 | 1239. | Dhanda, Pegg, et al., 2003 | 60. m/0.25 mm/0.25 μm, He, 35. C @ 2. min, 5. K/min, 280. C @ 4. min |
Capillary | Ultra-2 | 1256. | King, Matthews, et al., 1995 | 50. m/0.32 mm/0.52 μm, He, 40. C @ 3. min, 4. K/min, 250. C @ 30. min |
Capillary | Ultra-2 | 1252. | King, Hamilton, et al., 1993 | 50. m/0.32 mm/0.52 μm, He, 40. C @ 3. min, 4. K/min, 250. C @ 30. min |

References

Wolf, 1972
Wolf, G.,
Thermochemische Untersuchungen an cyclischen Ketonen,
Helv. Chim. Acta, 1972, 55, 1446-1459. [all data]
Wolf, 1972, 2
Wolf, G.,
Thermochemical studies of cyclic ketones,
Helv. Chim. Acta, 1972, 55, 1446. [all data]
Gonthier-Vassal and Szwarc, 1998
Gonthier-Vassal, Anne; Szwarc, Henri,
Thermodynamic properties of cycloketones: A DSC study,
Thermochimica Acta, 1998, 320, 1-2, 141-154, https://doi.org/10.1016/S0040-6031(98)00409-2
. [all data]
Aldrich Chemical Company Inc., 1990
Aldrich Chemical Company Inc.,
Catalog Handbook of Fine Chemicals, Aldrich Chemical Company, Inc., Milwaukee WI, 1990, 1. [all data]
Weast and Grasselli, 1989
CRC Handbook of Data on Organic Compounds, 2nd Editon, Weast,R.C and Grasselli, J.G., ed(s)., CRC Press, Inc., Boca Raton, FL, 1989, 1. [all data]
Stephenson and Malanowski, 1987
Stephenson, Richard M.; Malanowski, Stanislaw,
Handbook of the Thermodynamics of Organic Compounds, 1987, https://doi.org/10.1007/978-94-009-3173-2
. [all data]
Gonthier-Vassal and Szwarc, 1998, 2
Gonthier-Vassal, A.; Szwarc, H.,
Thermochim. Acta, 1998, 141. [all data]
Hunter and Lias, 1998
Hunter, E.P.; Lias, S.G.,
Evaluated Gas Phase Basicities and Proton Affinities of Molecules: An Update,
J. Phys. Chem. Ref. Data, 1998, 27, 3, 413-656, https://doi.org/10.1063/1.556018
. [all data]
Dhanda, Pegg, et al., 2003
Dhanda, J.S.; Pegg, R.B.; Shand, P.J.,
Saskatchewan specialty livestock value-added program - Saskatchewan agri-food innovation fund (AFIF) Project #98000016, 2003, retrieved from http://www.agr.gov.sk.ca/afif/Projects/19980016.pdf. [all data]
King, Matthews, et al., 1995
King, M.-F.; Matthews, M.A.; Rule, D.C.; Field, R.A.,
Effect of beef packaging method on volatile compounds developed by oven roasting or microwave cooking,
J. Agric. Food Chem., 1995, 43, 3, 773-778, https://doi.org/10.1021/jf00051a039
. [all data]
King, Hamilton, et al., 1993
King, M.-F.; Hamilton, B.L.; Matthews, M.A.; Rule, D.C.; Field, R.A.,
Isolation and identification of volatiles and condensable material in raw beef with supercritical carbon dioxide extraction,
J. Agric. Food Chem., 1993, 41, 11, 1974-1981, https://doi.org/10.1021/jf00035a030
. [all data]