trifluoronitrosomethane
- Formula: CF3NO
- Molecular weight: 99.0120
- CAS Registry Number: 334-99-6

Phase change data

Data compiled by: William E. Acree, Jr., James S. Chickos
Enthalpy of vaporization
ΔvapH (kcal/mol) | Temperature (K) | Method | Reference | Comment |
---|---|---|---|---|
4.09 | 159. | A | Stephenson and Malanowski, 1987 | Based on data from 141. to 174. K. |

Gas phase ion energetics data

Data evaluated as indicated in comments:
HL - Edward P. Hunter and Sharon G. Lias

Data compiled as indicated in comments:
LLK - Sharon G. Lias, Rhoda D. Levin, and Sherif A. Kafafi
B - John E. Bartmess

Quantity Value Units Method Reference Comment
Proton affinity (review)703.3kJ/molN/AHunter and Lias, 1998HL
Quantity Value Units Method Reference Comment
Gas basicity670.8kJ/molN/AHunter and Lias, 1998HL

Electron affinity determinations

EA (eV) Method Reference Comment
>2.00 ± 0.20EIAEHarland, 1977From(CF3)2NO; G3MP2B3 calculations indicate an EA of ca. 1.7 eV; B

Ionization energy determinations

IE (eV) Method Reference Comment
10.5 ± 0.1EISyrvatka and Gil'burd, 1973LLK

Appearance energy determinations

Ion AE (eV) Other Products MethodReferenceComment
CF2+16.7 ± 0.2FNOEISyrvatka and Gil'burd, 1973LLK
CF3+12.6 ± 0.1NOEISyrvatka and Gil'burd, 1973LLK
NO+12.4 ± 0.1CF3EISyrvatka and Gil'burd, 1973LLK
CNOF3+11.06 ± 0.05?PEErnsting, Pfab, et al., 1980Vertical value; LLK

References

Stephenson and Malanowski, 1987
Stephenson, Richard M.; Malanowski, Stanislaw,
Handbook of the Thermodynamics of Organic Compounds, 1987, https://doi.org/10.1007/978-94-009-3173-2
. [all data]