2,6-Dichlorobenzyl methyl ether
- Formula: C8H8Cl2O
- Molecular weight: 191.055
- IUPAC Standard InChIKey: QBKBHXIQLAMKOB-UHFFFAOYSA-N
- CAS Registry Number: 33486-90-7
- Chemical structure:
View 3d structure (requires JavaScript / HTML 5) - Other names: Benzene, 1,3-dichloro-2-(methoxymethyl)-; 2,6-Dichlorobenzyl alcohol, methyl ether; 1,3-Dichloro-2-(methoxymethyl)benzene

Van Den Dool and Kratz RI, non-polar column, temperature ramp

Column type | Active phase | I | Reference | Comment |
---|---|---|---|---|
Capillary | VF-5MS | 1342. | Todua, 2011 | 30. m/0.25 mm/0.25 μm, He; Tstart: 60. C; Tend: 270. C |

References

Todua, 2011
Todua, N.G.,
Retention Data. NIST Mass Spectrometry Data Center., NIST Mass Spectrometry Data Center, 2011. [all data]