Dodecane, 1-fluoro-
- Formula: C12H25F
- Molecular weight: 188.3253
- IUPAC Standard InChIKey: YHYBNVZCQIDLSQ-UHFFFAOYSA-N
- CAS Registry Number: 334-68-9
- Chemical structure:
View 3d structure (requires JavaScript / HTML 5) - Other names: Dodecyl fluoride; n-Dodecyl fluoride; 1-Fluorododecane

Gas phase thermochemistry data

Data compiled by: Hussein Y. Afeefy, Joel F. Liebman, and Stephen E. Stein
Quantity | Value | Units | Method | Reference | Comment |
---|---|---|---|---|---|
ΔfH°gas | -489.22 ± 0.61 | kJ/mol | Ccr | Schaffer, Verevkin, et al., 1997 |

Condensed phase thermochemistry data

Data compiled by: Hussein Y. Afeefy, Joel F. Liebman, and Stephen E. Stein
Quantity | Value | Units | Method | Reference | Comment |
---|---|---|---|---|---|
ΔfH°liquid | -553.19 ± 0.59 | kJ/mol | Ccr | Schaffer, Verevkin, et al., 1997 | |
Quantity | Value | Units | Method | Reference | Comment |
ΔcH°liquid | -7921.60 ± 0.59 | kJ/mol | Ccr | Schaffer, Verevkin, et al., 1997 |

Phase change data

Data compiled as indicated in comments:
ALS - Hussein Y. Afeefy, Joel F. Liebman, and Stephen E. Stein
AC - William E. Acree, Jr., James S. Chickos
Quantity | Value | Units | Method | Reference | Comment |
---|---|---|---|---|---|
ΔvapH° | 63.97 ± 0.16 | kJ/mol | V | Schaffer, Verevkin, et al., 1997 | ALS |
ΔvapH° | 64.0 ± 0.2 | kJ/mol | GS | Schaffer, Verevkin, et al., 1997 | Based on data from 288. to 328. K.; AC |
Enthalpy of vaporization
ΔvapH (kJ/mol) | Temperature (K) | Method | Reference | Comment |
---|---|---|---|---|
56.2 | 389. | A,E | Stephenson and Malanowski, 1987 | Based on data from 374. to 533. K. See also Li and Rossini, 1961 and Dykyj and Vanko, 1970.; AC |

References

Schaffer, Verevkin, et al., 1997
Schaffer, F.; Verevkin, S.P.; Rieger, H.J.; Beckhaus, H.D.; Ruchardt, C.,
Enthalpies of formation of a series of fluorinated hydrocarbons and strain-free group increments to assess polar and anomeric stabilization and strain,
Liebigs Ann., 1997, 1333-1344. [all data]
Stephenson and Malanowski, 1987
Stephenson, Richard M.; Malanowski, Stanislaw,
Handbook of the Thermodynamics of Organic Compounds, 1987, https://doi.org/10.1007/978-94-009-3173-2
. [all data]
Li and Rossini, 1961
Li, J.C.M.; Rossini, F.D.,
Vapor Pressures and Boiling Points of the l-Fluoroalkanes, l-Chloroalkanes, l-Bromoalkanes, and l-Iodoalkanes, C 1 to C 20 .,
J. Chem. Eng. Data, 1961, 6, 2, 268-270, https://doi.org/10.1021/je60010a025
. [all data]
Dykyj and Vanko, 1970
Dykyj, J.; Vanko, A.,
Petrochemica, 1970, 10, 1, 3. [all data]