1,3,6,8-Tetrachlorodibenzo-p-dioxin
- Formula: C12H4Cl4O2
- Molecular weight: 321.971
- IUPAC Standard InChIKey: OTQFXRBLGNEOGH-UHFFFAOYSA-N
- CAS Registry Number: 33423-92-6
- Chemical structure:
View 3d structure (requires JavaScript / HTML 5) - Other names: Dibenzo-p-dioxin, 1,3,6,8-tetrachloro-; Dibenzo(b,e)(1,4)dioxin, 1,3,6,8-tetrachloro-; 1,3,6,8-TCDD; 1,3,6,8-Tetrachlorodibenzodioxin; 1,3,6,8-Tetrachlorodibenzo-para-dioxin; 1,3,6,8-Tetrachlorobenzo-p-dioxin; 1,3,6,8-Tetrachlorodibenzo[1,4]dioxin; 1,3,6,8-Tetrachlorooxanthrene; 1,3,6,8-Tetrachlorodibenzo[b,e] [1,4]dioxin

Phase change data

Data compiled by: William E. Acree, Jr., James S. Chickos
Enthalpy of sublimation
ΔsubH (kJ/mol) | Temperature (K) | Method | Reference | Comment |
---|---|---|---|---|
118.6 ± 3.2 | 393. | ME | Li, Shibata, et al., 2004 | Based on data from 378. to 408. K. |

Van Den Dool and Kratz RI, non-polar column, temperature ramp

View large format table.

Column type Active phase I Reference Comment
CapillaryRTX-52260.Donnelly, Munslow, et al., 199130. m/0.25 mm/0.25 μm, He, 170. C @ 1. min, 2. K/min; Tend: 320. C
CapillaryRTX-52260.Donnelly, Munslow, et al., 199130. m/0.25 mm/0.25 μm, He, 170. C @ 1. min, 2. K/min; Tend: 320. C
CapillaryRTX-52260.Donnelly, Munslow, et al., 1991, 230. m/0.25 mm/0.25 μm, He, 170. C @ 1. min, 2. K/min; Tend: 320. C
CapillaryRTX-52260.Donnelly, Munslow, et al., 1991, 230. m/0.25 mm/0.25 μm, He, 170. C @ 1. min, 2. K/min; Tend: 320. C
CapillaryDB-52290.Donnelly, Munslow, et al., 198760. m/0.252 mm/0.25 μm, He, 170. C @ 1. min, 2. K/min; Tend: 340. C

Van Den Dool and Kratz RI, non-polar column, custom temperature program

View large format table.

Column type Active phase I Reference Comment
CapillaryHP-52262.Korhonen and Mantykoski, 198925. m/0.20 mm/0.11 μm, He; Program: 100 0C (1 min) 20 0C/min -> 180 0C 5 0C/min -> 290 0C (until elution of the last peak)
CapillaryHP-52290.Korhonen and Mantykoski, 198925. m/0.20 mm/0.11 μm, He; Program: 100 0C (1 min) 20 0C/min -> 180 0C 5 0C/min -> 290 0C (until elution of the last peak)

Normal alkane RI, non-polar column, temperature ramp

View large format table.

Column type Active phase I Reference Comment
CapillaryDB-52290.Zhao and Yu, 200760. m/0.25 mm/0.25 μm, He, 170. C @ 1. min, 2. K/min; Tend: 340. C

Normal alkane RI, non-polar column, custom temperature program

View large format table.

Column type Active phase I Reference Comment
CapillaryDB-52290.Lin, Liu, et al., 2002Program: not specified

References

Li, Shibata, et al., 2004
Li, Xian-Wei; Shibata, Etsuro; Kasai, Eiki; Nakamura, Takashi,
VAPOR PRESSURES AND ENTHALPIES OF SUBLIMATION OF 17 POLYCHLORINATED DIBENZO-p-DIOXINS AND FIVE POLYCHLORINATED DIBENZOFURANS,
Environ Toxicol Chem, 2004, 23, 2, 348-808, https://doi.org/10.1897/03-193
. [all data]