Diethylamine, 2,2'-dichloro-
- Formula: C4H9Cl2N
- Molecular weight: 142.027
- IUPAC Standard InChIKey: TXFLGZOGNOOEFZ-UHFFFAOYSA-N
- CAS Registry Number: 334-22-5
- Chemical structure:
View 3d structure (requires JavaScript / HTML 5) - Other names: N,N-Bis-(β-chloroethyl)-amine; Bis-β-chloroethylamine; NH-lost; Nor-nitrogen mustard; NSC-10873; Ethanamine, 2-chloro-N-(2-chloroethyl)-; 2,2'-Dichlorodiethylamine; Bis(beta-chloroethyl)amine; Bis(2-chloroethyl)amine; Bis(chloroethyl)amine; Di(2-chloroethyl)amine; N,N-Bis(2-chloroethane)amine; Nor-HN2; Nor-mechlorethamine; Nor-mustard; N,N-Bis(2-chloroethyl)amine; Nor-N-mustard; Nitrogen mustard

Normal alkane RI, non-polar column, custom temperature program

Column type | Active phase | I | Reference | Comment |
---|---|---|---|---|
Capillary | Polydimethyl siloxane | 1087. | Staples, 2006 | Program: not specified |

References

Staples, 2006
Staples, E.J.,
Creating a compound library for chemical warfare agents for the ZNose, 2006, retrieved from http://www.estcal.com/TechPapers/Security/CWA-Libraries.pdf. [all data]