Benzene, 1-methyl-4-(2-propenyl)-
- Formula: C10H12
- Molecular weight: 132.2023
- IUPAC Standard InChIKey: WAEOXIOXMKNFLQ-UHFFFAOYSA-N
- CAS Registry Number: 3333-13-9
- Chemical structure:
View 3d structure (requires JavaScript / HTML 5) - Other names: p-Allyltoluene; p-Methylallylbenzene; Toluene, p-allyl-; 1-Allyl-4-methylbenzene; 3-p-Tolylpropene; 4-Allyltoluene; 1-Methyl-4-(2-propenyl)benzene; 1-Methyl-4-allylbenzene

Kovats' RI, non-polar column, isothermal

Column type | Active phase | Temperature (C) | I | Reference | Comment |
---|---|---|---|---|---|
Capillary | SE-30 | 130. | 1047. | Bredael, 1982 | Column length: 100. m; Column diameter: 0.5 mm |
Capillary | SE-30 | 80. | 1033. | Bredael, 1982 | Column length: 100. m; Column diameter: 0.5 mm |
Capillary | SE-30 | 65. | 1033.3 | Svob, Deur-Siftar, et al., 1974 | He; Column length: 25.5 m; Column diameter: 0.5 mm |
Capillary | SE-30 | 65. | 1033.3 | Svob and Deur-Siftar, 1974 | He; Column length: 25.5 m; Column diameter: 0.5 mm |

Lee's RI, non-polar column, custom temperature program

Column type | Active phase | I | Reference | Comment |
---|---|---|---|---|
Capillary | DB-5 | 180.4 | Fuentes, Font, et al., 2007 | Column length: 60. m; Program: not specified |

Phase change data

Data compiled by: Thermodynamics Research Center, NIST Boulder Laboratories, Chris Muzny director
Quantity | Value | Units | Method | Reference | Comment |
---|---|---|---|---|---|
Tboil | 456.06 | K | N/A | Boord, Henne, et al., 1949 | Uncertainty assigned by TRC = 0.5 K |
Tboil | 456.06 | K | N/A | Boord, Greenlee, et al., 1946 | Uncertainty assigned by TRC = 0.3 K |
Tboil | 456.13 | K | N/A | Boord, Perilstein, et al., 1944 | Uncertainty assigned by TRC = 0.3 K |
Tboil | 459. | K | N/A | Sabatier and Murat, 1913 | Uncertainty assigned by TRC = 5. K |
Quantity | Value | Units | Method | Reference | Comment |
Tfus | 228.44 | K | N/A | Boord, Henne, et al., 1949 | Uncertainty assigned by TRC = 0.5 K |
Tfus | 228.44 | K | N/A | Boord, Greenlee, et al., 1946 | Uncertainty assigned by TRC = 0.2 K |
Tfus | 228.28 | K | N/A | Boord, Perilstein, et al., 1944 | Uncertainty assigned by TRC = 0.3 K |

References

Bredael, 1982
Bredael, P.,
Retention indices of hydrocarbons on SE-30,
J. Hi. Res. Chromatogr. Chromatogr. Comm., 1982, 5, 6, 325-328, https://doi.org/10.1002/jhrc.1240050610
. [all data]
Svob, Deur-Siftar, et al., 1974
Svob, V.; Deur-Siftar, D.; Cramers, C.A.,
Mechanisms of the thermal degradation of alkylbenzenes,
J. Chromatogr., 1974, 91, 659-675, https://doi.org/10.1016/S0021-9673(01)97946-4
. [all data]
Svob and Deur-Siftar, 1974
Svob, V.; Deur-Siftar, D.,
Kovats Retention Indices in the Identification of Alkylbenzene Degradation Products,
J. Chromatogr., 1974, 91, 677-689, https://doi.org/10.1016/S0021-9673(01)97947-6
. [all data]
Fuentes, Font, et al., 2007
Fuentes, M.J.; Font, R.; Gomez-Rico, M.F.; Martin-Gullon, I.,
Pyrolysis and combustion of waste lubricant oil from diesel cars: Decomposition and pollutants,
J. Anal. Appl. Pyrolysis, 2007, 79, 1-2, 215-226, https://doi.org/10.1016/j.jaap.2006.12.004
. [all data]