Potassium thiocyanate

Condensed phase thermochemistry data

Data compiled by: Eugene S. Domalski and Elizabeth D. Hearing

Quantity Value Units Method Reference Comment
solid,1 bar124.3J/mol*KN/AVanderzee and Westrum, 1970

Constant pressure heat capacity of solid

Cp,solid (J/mol*K) Temperature (K) Reference Comment
88.53298.15Vanderzee and Westrum, 1970T = 5 to 340 K.

References

Vanderzee and Westrum, 1970
Vanderzee, C.E.; Westrum, E.F., Jr., Heat capacities and thermodynamic properties of ammonium and potassium thiocyanates from 5 to 340K, J. Chem. Thermodynam., 1970, 2, 417-429. [all data]