3β,4β-Bis(trimethylsiloxy)cholest-5-ene
- Formula: C33H62O2Si2
- Molecular weight: 547.0152
- IUPAC Standard InChIKey: MVQMBDWKOGOQJG-FLDZLRFFSA-N
- CAS Registry Number: 33287-25-1
- Chemical structure:

Van Den Dool and Kratz RI, non-polar column, custom temperature program

Column type | Active phase | I | Reference | Comment |
---|---|---|---|---|
Capillary | VF-5MS | 3238.7 | Tret'yakov, 2008 | 30. m/0.25 mm/0.25 μm, He; Program: Multi-step temperature program; T(initial)=60C; T(final)=270C |

References

Tret'yakov, 2008
Tret'yakov, K.V.,
Retention Data. NIST Mass Spectrometry Data Center., NIST Mass Spectrometry Data Center, 2008. [all data]