3-Methoxyphenol, TMS derivative
- Formula: C10H16O2Si
- Molecular weight: 196.3183
- IUPAC Standard InChIKey: NYDBBTZNZLWXEP-UHFFFAOYSA-N
- CAS Registry Number: 33285-71-1
- Chemical structure:
View 3d structure (requires JavaScript / HTML 5) - Other names: Silane, (3-methoxyphenoxy)trimethyl-; Silane, (m-methoxyphenoxy)trimethyl-; (m-Methoxyphenoxy)trimethylsilane; m-Methoxyphenyl trimethylsilyl ether; 1-Methoxy-3-trimethylsilyloxybenzene; (3-Methoxyphenoxy)(trimethyl)silane; 3-Methoxyphenol, TMS ether; 3-Methoxyphenol, trimethylsilyl ether

Van Den Dool and Kratz RI, non-polar column, temperature ramp

Column type | Active phase | I | Reference | Comment |
---|---|---|---|---|
Packed | OV-1 | 1264. | Mattsson and Petersson, 1977 | N2, Supelcoport, 4. K/min; Column length: 2. m; Tstart: 80. C; Tend: 240. C |

Van Den Dool and Kratz RI, non-polar column, custom temperature program

Column type | Active phase | I | Reference | Comment |
---|---|---|---|---|
Capillary | VF-5MS | 1288.9 | Tret'yakov, 2008 | 30. m/0.25 mm/0.25 μm, He; Program: Multi-step temperature program; T(initial)=60C; T(final)=270C |

References

Mattsson and Petersson, 1977
Mattsson, M.; Petersson, G.,
Reference GLC Data for the Analysis of Phenolic Compounds as Trimethylsilyl Derivatives,
J. Chromatogr. Sci., 1977, 15, 12, 546-554, https://doi.org/10.1093/chromsci/15.12.546
. [all data]
Tret'yakov, 2008
Tret'yakov, K.V.,
Retention Data. NIST Mass Spectrometry Data Center., NIST Mass Spectrometry Data Center, 2008. [all data]