4-N-Hexylaniline
- Formula: C12H19N
- Molecular weight: 177.2860
- IUPAC Standard InChIKey: OVEMTTZEBOCJDV-UHFFFAOYSA-N
- CAS Registry Number: 33228-45-4
- Chemical structure:
View 3d structure (requires JavaScript / HTML 5) - Other names: 4-Hexylaniline; p-Hexylaniline; p-n-Hexylaniline; Benzenamine, 4-hexyl-; Aniline, (p-hexyl)-

Phase change data

Data compiled by: Robert L. Brown and Stephen E. Stein
Quantity | Value | Units | Method | Reference | Comment |
---|---|---|---|---|---|
Tboil | 555.2 | K | N/A | Aldrich Chemical Company Inc., 1990 |
Reduced pressure boiling point
Tboil (K) | Pressure (bar) | Reference |
---|---|---|
378. to 381. | 0.003 | Frinton Laboratories Inc., 1986 |

References

Aldrich Chemical Company Inc., 1990
Aldrich Chemical Company Inc.,
Catalog Handbook of Fine Chemicals, Aldrich Chemical Company, Inc., Milwaukee WI, 1990, 1. [all data]
Frinton Laboratories Inc., 1986
Frinton Laboratories Inc.,
Catalog Number 11, Frinton Laboratories Inc., Vineland, NJ, 1986, 99. [all data]