p-Pentylaniline
- Formula: C11H17N
- Molecular weight: 163.2594
- IUPAC Standard InChIKey: DGFTWBUZRHAHTH-UHFFFAOYSA-N
- CAS Registry Number: 33228-44-3
- Chemical structure:
View 3d structure (requires JavaScript / HTML 5) - Other names: p-n-Pentylaniline; p-n-Amylaniline; Benzenamine, 4-pentyl-; 4-Pentylaniline

Phase change data

Data compiled by: Robert L. Brown and Stephen E. Stein
Reduced pressure boiling point
Tboil (K) | Pressure (bar) | Reference |
---|---|---|
418. to 419. | 0.020 | Frinton Laboratories Inc., 1986 |

References

Frinton Laboratories Inc., 1986
Frinton Laboratories Inc.,
Catalog Number 11, Frinton Laboratories Inc., Vineland, NJ, 1986, 99. [all data]