Cyclohexane, 1,1'-(1,2-ethanediyl)bis-
- Formula: C14H26
- Molecular weight: 194.3562
- IUPAC Standard InChIKey: IBLVSWYGUFGDMF-UHFFFAOYSA-N
- CAS Registry Number: 3321-50-4
- Chemical structure:
View 3d structure (requires JavaScript / HTML 5) - Other names: Ethane, 1,2-dicyclohexyl-; 1,2-Dicyclohexylethane

Condensed phase thermochemistry data

Data compiled as indicated in comments:
ALS - Hussein Y. Afeefy, Joel F. Liebman, and Stephen E. Stein
DH - Eugene S. Domalski and Elizabeth D. Hearing
Quantity | Value | Units | Method | Reference | Comment |
---|---|---|---|---|---|
ΔcH°liquid | -8347. | kJ/mol | Ccb | Serijan and Wise, 1951 | Corresponding ΔfHºliquid = -879. kJ/mol (simple calculation by NIST; no Washburn corrections); ALS |
ΔcH°liquid | -8842.9 ± 8.8 | kJ/mol | Ccb | Brull, 1935 | Reanalyzed by Cox and Pilcher, 1970, Original value = -8832.51 kJ/mol; Corresponding ΔfHºliquid = -382.0 kJ/mol (simple calculation by NIST; no Washburn corrections); ALS |
Constant pressure heat capacity of liquid
Cp,liquid (J/mol*K) | Temperature (K) | Reference | Comment |
---|---|---|---|
367.8 | 313. | Gudinowicz, Campbell, et al., 1963 | T = 313 to 483 K.; DH |

Phase change data

Data compiled as indicated in comments:
TRC - Thermodynamics Research Center, NIST Boulder Laboratories, Chris Muzny director
BS - Robert L. Brown and Stephen E. Stein
AC - William E. Acree, Jr., James S. Chickos
Quantity | Value | Units | Method | Reference | Comment |
---|---|---|---|---|---|
Tboil | 544. ± 7. | K | AVG | N/A | Average of 6 values; Individual data points |
Quantity | Value | Units | Method | Reference | Comment |
Tfus | 284.65 | K | N/A | Anonymous, 1968 | Uncertainty assigned by TRC = 0.5 K; TRC |
Tfus | 284.60 | K | N/A | Serijan and Wise, 1951, 2 | Uncertainty assigned by TRC = 0.3 K; TRC |
Tfus | 284.60 | K | N/A | Serijan and Wise, 1951, 3 | Uncertainty assigned by TRC = 0.2 K; TRC |
Tfus | 284.7 | K | N/A | Schiessler, 1947 | Uncertainty assigned by TRC = 1. K; TRC |
Reduced pressure boiling point
Tboil (K) | Pressure (bar) | Reference | Comment |
---|---|---|---|
415. to 417. | 0.020 | Frinton Laboratories Inc., 1986 | BS |
Enthalpy of vaporization
ΔvapH (kJ/mol) | Temperature (K) | Method | Reference | Comment |
---|---|---|---|---|
65.4 | 386. | A | Stephenson and Malanowski, 1987 | Based on data from 371. to 402. K.; AC |

Kovats' RI, non-polar column, isothermal

View large format table.

Column type Active phase Temperature (C) I Reference Comment
PackedSE-30150.1498.Shlyakhov, Anvaer, et al., 1975
PackedSE-30200.1529.Shlyakhov, Anvaer, et al., 1975
PackedApiezon L150.1544.Shlyakhov, Anvaer, et al., 1975
PackedSE-30130.1490.Antheaume and Guiochon, 1965
PackedSE-30170.1507.Antheaume and Guiochon, 1965
PackedSE-30184.1515.Antheaume and Guiochon, 1965
PackedMethyl Silicone130.1490.Antheaume and Guiochon, 1965

Van Den Dool and Kratz RI, non-polar column, temperature ramp

View large format table.

Column type Active phase I Reference Comment
CapillaryDB-51496.3Song, Lai, et al., 200330. m/0.25 mm/0.25 μm, He, 4. K/min; Tstart: 40. C; Tend: 310. C
CapillaryDB-51495.0Song, Lai, et al., 200330. m/0.25 mm/0.25 μm, He, 40. C @ 5. min, 4. K/min; Tend: 310. C
CapillaryDB-51486.9Song, Lai, et al., 200330. m/0.25 mm/0.25 μm, He, 2. K/min; Tstart: 40. C; Tend: 310. C
CapillaryDB-51496.3Song, Lai, et al., 200330. m/0.25 mm/0.25 μm, He, 4. K/min; Tstart: 40. C; Tend: 310. C
CapillaryDB-51501.0Song, Lai, et al., 200330. m/0.25 mm/0.25 μm, He, 6. K/min; Tstart: 40. C; Tend: 310. C
CapillaryDB-51486.9Lai and Song, 199530. m/0.25 mm/0.25 μm, He, 2. K/min; Tstart: 40. C; Tend: 310. C
CapillaryDB-51496.3Lai and Song, 199530. m/0.25 mm/0.25 μm, He, 4. K/min; Tstart: 40. C; Tend: 310. C
CapillaryDB-51501.Lai and Song, 199530. m/0.25 mm/0.25 μm, He, 6. K/min; Tstart: 40. C; Tend: 310. C
CapillaryDB-51496.3Lai and Song, 199530. m/0.25 mm/0.25 μm, He, 4. K/min; Tstart: 40. C; Tend: 310. C
CapillaryDB-51495.0Lai and Song, 199530. m/0.25 mm/0.25 μm, He, 40. C @ 5. min, 4. K/min; Tend: 310. C

References

Serijan and Wise, 1951
Serijan, K.T.; Wise, P.H.,
Dicyclic hydrocarbons. III. Diphenyl- and dicyclohexylalkanes through C15,
J. Am. Chem. Soc., 1951, 73, 4766-4769. [all data]
Brull, 1935
Brull, L.,
Sui calori di combustione di alcuni derivati del bifenil,
Gazz. Chim. Ital., 1935, 65, 19-28. [all data]
Cox and Pilcher, 1970
Cox, J.D.; Pilcher, G.,
Thermochemistry of Organic and Organometallic Compounds, Academic Press, New York, 1970, 1-636. [all data]
Gudinowicz, Campbell, et al., 1963
Gudinowicz, B.J.; Campbell, R.H.; Adams, J.S.,
Specific heat measurements of complex saturated hydrocarbons,
J. Chem. Eng. Data, 1963, 8, 201-214. [all data]
Anonymous, 1968
Anonymous, R.,
Properties of hydrocarbon of high molecular weight, Am. Pet. Inst. Res. Proj. 42, Penn. State Univ., 1968. [all data]
Serijan and Wise, 1951, 2
Serijan, K.T.; Wise, P.H.,
, Natl. Advis. Comm. Aeronaut., Lewis Flight Propulsion Lab ., Cleveland, 1951. [all data]
Serijan and Wise, 1951, 3
Serijan, K.T.; Wise, P.H.,
Dicylic Hydrocarbons. III. Diphenyl- and Dicyclohexylalkanes through C15,
J. Am. Chem. Soc., 1951, 73, 4766. [all data]
Schiessler, 1947
Schiessler, R.W.,
, Am. Pet. Inst. Res. Proj. 42, Twelfth Meeting, 1947. [all data]
Frinton Laboratories Inc., 1986
Frinton Laboratories Inc.,
Catalog Number 11, Frinton Laboratories Inc., Vineland, NJ, 1986, 99. [all data]
Stephenson and Malanowski, 1987
Stephenson, Richard M.; Malanowski, Stanislaw,
Handbook of the Thermodynamics of Organic Compounds, 1987, https://doi.org/10.1007/978-94-009-3173-2
. [all data]