Glycyl-L-phenyl alanine
- Formula: C11H14N2O3
- Molecular weight: 222.2405
- IUPAC Standard InChIKey: JBCLFWXMTIKCCB-UHFFFAOYSA-N
- CAS Registry Number: 3321-03-7
- Chemical structure:
View 3d structure (requires JavaScript / HTML 5) - Other names: L-Phenylalanine, N-glycyl-; N-glycyl-3-phenylalanine

Condensed phase thermochemistry data

Data compiled by: Hussein Y. Afeefy, Joel F. Liebman, and Stephen E. Stein
Quantity | Value | Units | Method | Reference | Comment |
---|---|---|---|---|---|
ΔcH°solid | -5645.1 ± 1.8 | kJ/mol | Ccb | Ponomarev, Alekseeva, et al., 1962 |

Reaction thermochemistry data

Data compiled by: Robert C. Dunbar
Individual Reactions
By formula: Na+ + C11H14N2O3 = (Na+ • C11H14N2O3)
Free energy of reaction
ΔrG° (kJ/mol) | T (K) | Method | Reference |
---|---|---|---|
159. | 0. | CIDC | Feng, Gronert, et al., 1999 |

Ion clustering data

Data compiled by: Robert C. Dunbar
Clustering reactions
By formula: Na+ + C11H14N2O3 = (Na+ • C11H14N2O3)
Free energy of reaction
ΔrG° (kJ/mol) | T (K) | Method | Reference |
---|---|---|---|
159. | 0. | CIDC | Feng, Gronert, et al., 1999 |

References

Ponomarev, Alekseeva, et al., 1962
Ponomarev, V.V.; Alekseeva, T.A.; Akimova, L.N.,
Heats of combustion of some peptides,
Russ. J. Phys. Chem. (Engl. Transl.), 1962, 36, 457-458. [all data]
Feng, Gronert, et al., 1999
Feng, W.Y.; Gronert, S.; Lebrilla, C.B.,
Lithium and sodium ion binding energies of N-acetyl and N-glycyl amino acids,
J. Am. Chem. Soc., 1999, 121, 6, 1365, https://doi.org/10.1021/ja983116s
. [all data]