Furan, 2,5-diethoxytetrahydro-
- Formula: C8H16O3
- Molecular weight: 160.2108
- IUPAC Standard InChIKey: ZLKHNURELCONBB-UHFFFAOYSA-N
- CAS Registry Number: 3320-90-9
- Chemical structure:
View 3d structure (requires JavaScript / HTML 5) - Other names: 2,5-Diethoxytetrahydrofuran; 2-5-Diethoxytetrahydrofuran,c&t

Phase change data

Data compiled by: Robert L. Brown and Stephen E. Stein
Quantity | Value | Units | Method | Reference | Comment |
---|---|---|---|---|---|
Tboil | 443.7 | K | N/A | Aldrich Chemical Company Inc., 1990 |

Normal alkane RI, non-polar column, custom temperature program

Column type | Active phase | I | Reference | Comment |
---|---|---|---|---|
Capillary | HP-5 | 1016. | Zhao, Li, et al., 2008 | 30. m/0.25 mm/0.25 μm; Program: 40 0C (2 min) 5 0C/min -> 80 0C 7 oC/min -> 160 0C 9 0C/min -> 200 0C 20 0C/min -> 280 0C (10 min) |

References

Aldrich Chemical Company Inc., 1990
Aldrich Chemical Company Inc.,
Catalog Handbook of Fine Chemicals, Aldrich Chemical Company, Inc., Milwaukee WI, 1990, 1. [all data]
Zhao, Li, et al., 2008
Zhao, Y.; Li, J.; Xu, Y.; Duan, H.; Fan, W.; Zhao, G.,
EXtraction, preparation and identification of volatile compounds in Changyu XO brandy,
Chinese J. Chromatogr., 2008, 26, 2, 212-222, https://doi.org/10.1016/S1872-2059(08)60014-0
. [all data]