Benzene, 1-chloro-2-isocyanato-
- Formula: C7H4ClNO
- Molecular weight: 153.566
- IUPAC Standard InChIKey: NOHQUGRVHSJYMR-UHFFFAOYSA-N
- CAS Registry Number: 3320-83-0
- Chemical structure:
View 3d structure (requires JavaScript / HTML 5) - Species with the same structure:
- Other names: Isocyanic acid, o-chlorophenyl ester; o-Chlorophenyl isocyanate; 2-Chlorophenyl isocyanate; 1-Chloro-2-isocyanatobenzene

Condensed phase thermochemistry data

Data compiled by: Hussein Y. Afeefy, Joel F. Liebman, and Stephen E. Stein
Quantity | Value | Units | Method | Reference | Comment |
---|---|---|---|---|---|
ΔfH°solid | -74.5 ± 4.2 | kJ/mol | Ccb | Selivanov and Konstantinov, 1975 | |
Quantity | Value | Units | Method | Reference | Comment |
ΔcH°solid | -3272. ± 4.2 | kJ/mol | Ccb | Selivanov and Konstantinov, 1975 |

References

Selivanov and Konstantinov, 1975
Selivanov, V.D.; Konstantinov, I.I.,
Thermochemistry of chloroaryl isocyanates,
Russ. J. Phys. Chem. (Engl. Transl.), 1975, 49, 620-621. [all data]