tri(2-Ethylhexyl) trimellitate
- Formula: C33H54O6
- Molecular weight: 546.7783
- IUPAC Standard InChIKey: KRADHMIOFJQKEZ-UHFFFAOYSA-N
- CAS Registry Number: 3319-31-1
- Chemical structure:

Phase change data

Data compiled by: William E. Acree, Jr., James S. Chickos
Enthalpy of vaporization
ΔvapH (kcal/mol) | Temperature (K) | Method | Reference | Comment |
---|---|---|---|---|
19.4 | 346. | ME | Liang and Ma, 2000 | Based on data from 331. to 371. K. |

References

Liang and Ma, 2000
Liang, Y.-H.; Ma, P.-S.,
Measurement of very low vapor pressures of three plasticizers by mass effusion method,
Shiyou Huagong, 2000, 29, 12, 939. [all data]