1,1'-Biphenyl, 2,6-dichloro-
- Formula: C12H8Cl2
- Molecular weight: 223.098
- IUPAC Standard InChIKey: IYZWUWBAFUBNCH-UHFFFAOYSA-N
- CAS Registry Number: 33146-45-1
- Chemical structure:
View 3d structure (requires JavaScript / HTML 5) - Other names: Biphenyl, 2,6-dichloro-; 2,6-Dichloro-1,1'-biphenyl; 2,6-Dichlorobiphenyl; PCB 10

Phase change data

Data compiled as indicated in comments:
TRC - Thermodynamics Research Center, NIST Boulder Laboratories, Chris Muzny director
AC - William E. Acree, Jr., James S. Chickos
Quantity | Value | Units | Method | Reference | Comment |
---|---|---|---|---|---|
Tfus | 307.9 | K | N/A | Miller, Ghodbane, et al., 1984 | Uncertainty assigned by TRC = 0.2 K; TRC |
Enthalpy of fusion
ΔfusH (kcal/mol) | Temperature (K) | Reference | Comment |
---|---|---|---|
3.01 | 307.9 | Acree, 1991 | AC |

Kovats' RI, non-polar column, isothermal

Column type | Active phase | Temperature (C) | I | Reference | Comment |
---|---|---|---|---|---|
Capillary | Apiezon L | 200. | 1639. | Krupcík, Leclercq, et al., 1980 | N2; Column length: 50. m; Column diameter: 0.25 mm |
Packed | OV-101 | 200. | 1620. | Albro, Haseman, et al., 1977 | Chromosorb W HP (80-100 mesh); Column length: 3. m |
Capillary | OV-101 | 150. | 1590. | Zell, Neu, et al., 1977 | Column length: 27. m |
Capillary | OV-101 | 150. | 1591. | Zell, Neu, et al., 1977 | Column length: 27. m |
Capillary | OV-101 | 180. | 1610.1 | Krupcik, Leclercq, et al., 1976 | Column length: 50. m |
Capillary | OV-101 | 190. | 1618.6 | Krupcik, Leclercq, et al., 1976 | Column length: 50. m |
Capillary | OV-101 | 200. | 1627.9 | Krupcik, Leclercq, et al., 1976 | Column length: 50. m |

Normal alkane RI, non-polar column, isothermal

Column type | Active phase | Temperature (C) | I | Reference | Comment |
---|---|---|---|---|---|
Capillary | Apiezon L | 180. | 1638. | Ballschmiter and Zell, 1980 | H2; Column length: 40. m; Column diameter: 0.30 mm |
Capillary | Apiezon L | 180. | 1638. | Ballschmiter and Zell, 1980 | H2; Column length: 40. m; Column diameter: 0.30 mm |

Normal alkane RI, non-polar column, temperature ramp

Column type | Active phase | I | Reference | Comment |
---|---|---|---|---|
Capillary | HP-5 | 1591. | Zenkevich, Moeder, et al., 2004 | 30. m/0.25 mm/0.25 μm, Helium, 50. C @ 3. min, 3. K/min, 280. C @ 20. min |
Capillary | SPB-1 | 1580. | Nakano, Tsuji, et al., 1987 | 30. m/0.25 mm/0.25 μm, 4. K/min; Tstart: 130. C; Tend: 280. C |

Normal alkane RI, non-polar column, custom temperature program

Column type | Active phase | I | Reference | Comment |
---|---|---|---|---|
Capillary | Apolane | 1560. | Bush, Murphy, et al., 1985 | He; Column length: 50. m; Column diameter: 0.25 mm; Program: 70 0C (2 min) 10 0C/min (6 min) 2 0C/min -> 250 0C |
Capillary | Apolane | 1562. | Bush, Murphy, et al., 1985 | He; Column length: 50. m; Column diameter: 0.25 mm; Program: 70 0C (2 min) 10 0C/min (6 min) 2 0C/min -> 250 0C |

References

Miller, Ghodbane, et al., 1984
Miller, M.M.; Ghodbane, S.; Wasik, S.P.; Tewari, Y.B.; Martire, D.E.,
Aqueous Solubilities, Octanol/Water Partition Coefficients, and Entropies of Melting of Chlorinated Benzenes and Biphenyls,
J. Chem. Eng. Data, 1984, 29, 184-190. [all data]
Acree, 1991
Acree, William E.,
Thermodynamic properties of organic compounds: enthalpy of fusion and melting point temperature compilation,
Thermochimica Acta, 1991, 189, 1, 37-56, https://doi.org/10.1016/0040-6031(91)87098-H
. [all data]
Krupcík, Leclercq, et al., 1980
Krupcík, J.; Leclercq, P.A.; Garaj, J.; Símová, A.,
Analysis of alkylated mixtures of polychlorinated biphenyls by capillary gas chromatography-mass spectrometry,
J. Chromatogr., 1980, 191, 207-220, https://doi.org/10.1016/S0021-9673(00)86381-5
. [all data]
Albro, Haseman, et al., 1977
Albro, P.W.; Haseman, J.K.; Clemmer, T.A.; Corbett, B.J.,
Identification of the Individual Polychlorinated Biphenyls in a Mixture by Gas-Liquid Chromatography,
J. Chromatogr., 1977, 136, 1, 147-153, https://doi.org/10.1016/S0021-9673(00)83003-4
. [all data]
Zell, Neu, et al., 1977
Zell, M.; Neu, H.J.; Ballschmiter, K.,
Identifizierung der PCB-Komponenten durch retentionsindexvergleich nach kapillar-gaschromatographie,
Chemosphere, 1977, 2/3, 2-3, 69-76, https://doi.org/10.1016/0045-6535(77)90047-9
. [all data]
Krupcik, Leclercq, et al., 1976
Krupcik, J.; Leclercq, P.A.; Símová, A.; Suchánek, P.; Collák, M.; Hrivnák, J.,
Possibilities and limitations of capillary gas chromatography and mass spectrometry in the analysis of polychlorinated biphenyls,
J. Chromatogr., 1976, 119, 271-283, https://doi.org/10.1016/S0021-9673(00)86791-6
. [all data]
Ballschmiter and Zell, 1980
Ballschmiter, K.; Zell, M.,
Analysis of polychlorinated biphenyls (PCB) by glass capillary gas chromatography,
Fresenius Z. Anal. Chem., 1980, 302, 1, 20-31, https://doi.org/10.1007/BF00469758
. [all data]
Zenkevich, Moeder, et al., 2004
Zenkevich, I.G.; Moeder, M.; Koeller, G.; Schrader, S.,
Using new structurally related additive schemes in the precalculation of gas chromatographic retention indices of polychlorinated hydroxybiphenyls on HP-5 stationary phase,
J. Chromatogr. A, 2004, 1025, 2, 227-236, https://doi.org/10.1016/j.chroma.2003.10.106
. [all data]
Nakano, Tsuji, et al., 1987
Nakano, T.; Tsuji, M.; Okuno, T.,
Analytical methods for PCB using GC/ECD and GC/MS with capillary column,
Report of the Environmental Science Institute of Hyoho Prefecture, 1987, 19, 57-62. [all data]
Bush, Murphy, et al., 1985
Bush, B.; Murphy, M.J.; Connor, S.; Snow, J.; Barnard, E.,
Improvements in Glass Capillary Gas Chromatographic Polychlorobiphenyl Analysis,
J. Chromatogr. Sci., 1985, 23, 11, 509-515, https://doi.org/10.1093/chromsci/23.11.509
. [all data]