Lilac alcohol D
- Formula: C10H18O2
- Molecular weight: 170.2487
- IUPAC Standard InChIKey: VUEGXHXUMOZKKN-UHFFFAOYSA-N
- CAS Registry Number: 33081-37-7
- Chemical structure:
View 3d structure (requires JavaScript / HTML 5) - Species with the same structure:
- Stereoisomers:
- Other names: 2-Furanethanol, 5-ethenyltetrahydro-β,5-dimethyl-, (βS,2R,5S)-; Lilac alcohol (isomer IV)

Van Den Dool and Kratz RI, non-polar column, temperature ramp

Column type | Active phase | I | Reference | Comment |
---|---|---|---|---|
Capillary | Equity-5 | 1237. | Rocha, Coelho, et al., 2007 | 60. m/0.25 mm/1. μm, He, 40. C @ 1. min, 5. K/min, 260. C @ 15. min |

Normal alkane RI, non-polar column, temperature ramp

Column type | Active phase | I | Reference | Comment |
---|---|---|---|---|
Capillary | ZP-5 | 1232. | Füssel, Dötterl, et al., 2007 | 60. m/0.25 mm/0.25 μm, He, 40. C @ 7. min, 6. K/min, 260. C @ 1. min |
Capillary | CP Sil 8 CB | 1229. | Li, Lee, et al., 2006 | 30. m/0.25 mm/0.25 μm, 40. C @ 5. min, 3. K/min, 250. C @ 20. min |
Capillary | ZB-5 | 1232. | Dötterl and Jürgens, 2005 | 60. m/0.25 mm/0.25 μm, He, 40. C @ 7. min, 6. K/min, 250. C @ 1. min |
Capillary | ZB-5 | 1232. | Dötterl, Wolfe, et al., 2005 | 60. m/0.25 mm/0.25 μm, He, 40. C @ 7. min, 6. K/min, 250. C @ 1. min |

Normal alkane RI, polar column, temperature ramp

Column type | Active phase | I | Reference | Comment |
---|---|---|---|---|
Capillary | HP-Innowax | 1838. | Soria, Sanz, et al., 2008 | 50. m/0.20 mm/0.20 μm, Helium, 45. C @ 2. min, 4. K/min, 190. C @ 50. min |
Capillary | HP-Innowax | 1845. | Soria, Gonzalez, et al., 2004 | 50. m/0.2 mm/0.2 μm, He, 45. C @ 2. min, 4. K/min, 190. C @ 50. min |

References

Rocha, Coelho, et al., 2007
Rocha, S.M.; Coelho, E.; Zrostlikova, J.; Delgadillo, I.; Coimbra b, M.A.,
Comprehensive two-dimensional gas chromatography with time-of-flight mass spectrometry of monoterpenoids as a powerful tool for grape origin traceability,
J. Chromatogr. A, 2007, 1161, 1-2, 292-299, https://doi.org/10.1016/j.chroma.2007.05.093
. [all data]
Füssel, Dötterl, et al., 2007
Füssel, U.; Dötterl, S.; Jürgens, A.; Aas, G.,
Inter- and intraspecific variation in floral scent in the genus Salix and its implication for pollination,
J. Chem. Ecol., 2007, 33, 4, 749-765, https://doi.org/10.1007/s10886-007-9257-6
. [all data]
Li, Lee, et al., 2006
Li, Z.-G.; Lee, M.-R.; Shen, D.-L.,
Analysis of volatile compounds emitted from fresh Syringa oblata flowers in different florescence by headspace solid-phase microextraction-gas chromatography-mass spectrometry,
Anal. Chim. Acta., 2006, 576, 1, 43-49, https://doi.org/10.1016/j.aca.2006.01.074
. [all data]
Dötterl and Jürgens, 2005
Dötterl, S.; Jürgens, A.,
Spatial fragrance patterns in flowers of Silene latifolia: Lilac compounds as olfactory nectar guides?,
Plant Systematics and Evolution, 2005, 255, 1-2, 99-109, https://doi.org/10.1007/s00606-005-0344-2
. [all data]
Dötterl, Wolfe, et al., 2005
Dötterl, S.; Wolfe, L.M.; Jürgens, A.,
Qualitative and quantitative analyses of flower scent in Silene latifolia,
Phytochemistry, 2005, 66, 2, 203-213, https://doi.org/10.1016/j.phytochem.2004.12.002
. [all data]
Soria, Sanz, et al., 2008
Soria, A.C.; Sanz, J.; Martinez-Castro, I.,
SPME followed by GC-MS: a powerful technique for qualitative analysis of honey volatiles,
Eur. Food Res. Technol., 2008, 1-12. [all data]
Soria, Gonzalez, et al., 2004
Soria, A.C.; Gonzalez, M.; de Lorenzo, C.; Martinez-Castro, I.; Sanza, J.,
Characterization of artisanal honeys from Madrid (Central Spain) on the basis of their melissopalynological, physicochemical and volatile composition data,
Food Chem., 2004, 85, 1, 121-130, https://doi.org/10.1016/j.foodchem.2003.06.012
. [all data]