Linuron
- Formula: C9H10Cl2N2O2
- Molecular weight: 249.094
- IUPAC Standard InChIKey: XKJMBINCVNINCA-UHFFFAOYSA-N
- CAS Registry Number: 330-55-2
- Chemical structure:
View 3d structure (requires JavaScript / HTML 5) - Other names: Urea, N'-(3,4-dichlorophenyl)-N-methoxy-N-methyl-; Urea, 3-(3,4-dichlorophenyl)-1-methoxy-1-methyl-; Afalon; Afalon inuron; Aphalon; Cephalon; Du Pont 326; DuPont Herbicide 326; Herbicide 326; Lorex; Lorox; Methoxydiuron; Sinuron; 3-(3,4-Dichloor-fenyl)-1-methoxy-1-methylureum; 3-(3,4-Dichloro-fenil)-1-metossi-1-metil-urea; 3-(3,4-Dichlorophenyl)-1-methoxy-1-methylurea; N'-(3,4-Dichlorophenyl)-N-methoxy-N-methylurea; 1-(3,4-Dichlorophenyl)3-methoxy-3-methyluree; N-(3,4-Dichlorophenyl)-N'-methyl-N'-methoxyurea; 3-(3,4-Dichlor-phenyl)-1-methoxy-1-methyl-harnstoff; 3-(4,5-Dichlorphenyl)-1-methoxy-1-methylharnstoff; N-(3,4-Dwuchlorofenylo)N'-metoksy-N'-metylomocznik; Garnitan; HOE 2810; Laroks; Linex 4L; Linorox; Linurex; Lorox linuron weed killer; 1-Methoxy-1-methyl-3-(3,4-dichlorophenyl)urea; Sarclex; Scarclex; Atlas linuron; Norunil; Rotalin; Alfalon; N'-(3,4-dichlorophenyl)-N-methoxy-N-methylurea (linuron)

Phase change data

Data compiled as indicated in comments:
TRC - Thermodynamics Research Center, NIST Boulder Laboratories, Chris Muzny director
AC - William E. Acree, Jr., James S. Chickos
Quantity | Value | Units | Method | Reference | Comment |
---|---|---|---|---|---|
Tfus | 366.76 | K | N/A | Donnelly, Drewes, et al., 1990 | Uncertainty assigned by TRC = 0.2 K; TRC |
Tfus | 365.9 | K | N/A | Plato and Glasgow, 1969 | Uncertainty assigned by TRC = 0.2 K; TRC |
Enthalpy of fusion
ΔfusH (kJ/mol) | Temperature (K) | Method | Reference | Comment |
---|---|---|---|---|
26.56 | 365.8 | DSC | Acree, 1991 | See also Donnelly, Drewes, et al., 1990, 2.; AC |
24.53 | 315. | DSC | Acree, 1991 | See also Donnelly, Drewes, et al., 1990, 2.; AC |

Kovats' RI, non-polar column, temperature ramp

Column type | Active phase | I | Reference | Comment |
---|---|---|---|---|
Capillary | DB-1 | 1927. | Hall, Whitehead, et al., 1986 | He, 6. K/min; Column length: 15. m; Column diameter: 0.25 mm; Tstart: 100. C; Tend: 270. C |
Capillary | DB-5 | 1960. | Hall, Whitehead, et al., 1986 | He, 6. K/min; Column length: 15. m; Column diameter: 0.25 mm; Tstart: 100. C; Tend: 270. C |

Kovats' RI, non-polar column, custom temperature program

Column type | Active phase | I | Reference | Comment |
---|---|---|---|---|
Capillary | HP-5 | 1952. | Tanabe, Mitobe, et al., 2000 | 30. m/0.32 mm/0.25 μm; Program: 50C(1min) => 20C/min => 150C => 10C/min => 280C(4min) |

Normal alkane RI, non-polar column, temperature ramp

Column type | Active phase | I | Reference | Comment |
---|---|---|---|---|
Capillary | Ultra-1 | 1884. | Okumura, 1991 | 25. m/0.32 mm/0.25 μm, He, 3. K/min; Tstart: 80. C; Tend: 260. C |

Normal alkane RI, non-polar column, custom temperature program

Column type | Active phase | I | Reference | Comment |
---|---|---|---|---|
Capillary | HP-5 | 1952. | Kawara, Asada, et al., 2005 | 30. m/0.25 mm/0.25 μm; Program: 50 0C (1 min) 20 0C/min -> 150 0C 10 0C/min -> 280 0C |

References

Donnelly, Drewes, et al., 1990
Donnelly, J.R.; Drewes, L.A.; Johnson, R.L.; Munslow, W.D.; Knapp, K.K.; Sovocool, G.W.,
Purity and heat of fusion data for environmental standards as determined by differential scanning calorimetry,
Thermochim. Acta, 1990, 167, 2, 155, https://doi.org/10.1016/0040-6031(90)80476-F
. [all data]
Plato and Glasgow, 1969
Plato, C.; Glasgow, A.R., Jr.,
Differential scanning calorimetry as a general method for determining the purity and heat of fusion of high-purity organic chemicals. Application to 95 compounds,
Anal. Chem., 1969, 41, 2, 330, https://doi.org/10.1021/ac60271a041
. [all data]
Acree, 1991
Acree, William E.,
Thermodynamic properties of organic compounds: enthalpy of fusion and melting point temperature compilation,
Thermochimica Acta, 1991, 189, 1, 37-56, https://doi.org/10.1016/0040-6031(91)87098-H
. [all data]
Donnelly, Drewes, et al., 1990, 2
Donnelly, J.R.; Drewes, L.A.; Johnson, R.L.; Munslow, W.D.; Knapp, K.K.; Sovocool, G.W.,
Purity and heat of fusion data for environmental standards as determined by differential scanning calorimetry,
Thermochimica Acta, 1990, 167, 2, 155-187, https://doi.org/10.1016/0040-6031(90)80476-F
. [all data]